{"text_format":"3","workbook":"xlsx","n_sheets":15,"sheets":["Admin Info","Proposal Budget","A. Personnel","C. Purchase","C2. Equipment IST","C2. Equip. IST-ID","Teachers & Researchers","Post docs","Other personnel","Scholarships","Ph.D. Salary level","Equipment Useful Life Table IST","Equip. Useful Life Table IST-ID","Cálculo Seg. acidentes trabalho","Cálculo Seg. acidentes trab"],"not_rendered":{"images":18,"defined_names":28},"read":"whole","date_system":"1900"}

{"sheet":"Admin Info","index":0,"n_rows":21,"n_cols":5,"rows_kept":21,"merged":[[1,1,2,1],[1,2,1,3],[2,2,2,3],[8,1,8,3],[9,4,9,6],[13,2,13,3],[13,4,13,5],[14,2,14,3],[14,4,14,5],[18,2,18,3],[20,2,20,3]]}
[]
[null,"PIC NUMBER (Participant Identification Code)","IST -  Instituto Superior Técnico",null,999992983]
[null,null,"IST-ID Associação do Instituto Superior Técnico para a Investigação e Desenvolvimento",null,954983722]
[]
[null,"Folha de cálculo elaborado por:","NPI, DP"]
[]
{"$rows_left_out":16}
{"sheet":"Proposal Budget","index":1,"n_rows":31,"n_cols":7,"rows_kept":31,"merged":[[0,0,0,3],[2,1,2,2],[3,1,3,2],[4,1,4,2],[5,1,5,2],[6,1,6,2],[7,1,7,2],[9,0,23,0],[9,1,23,1],[9,2,9,3],[10,2,10,3],[11,2,13,2],[14,2,21,2],[22,2,22,3],[23,2,23,3],[24,0,30,0],[24,1,26,1],[24,2,26,2],[27,2,27,3],[28,1,29,1],[28,2,28,3],[29,2,29,3],[30,1,30,3],[33,0,33,3]]}
["Enter values in yellow cells only",{"$nulls":4},"BUDGET FEASIBILITY"]
[{"$nulls":5},"Time allocation",{"$f":"+'A. Personnel'!D26","v":0}]
[null,"Call",{"$nulls":3},"Real costs",{"$f":"SUM(E10:E22)-G2","v":0}]
[null,"Beneficiary",null,null,"(dropdown)","Non Elegible Equipment Costs",{"$f":"+'C. Purchase'!E17","v":0}]
[null,"Acronym",{"$nulls":3},"Other Non Elegible Costs"]
[null,"Proposal reference",{"$nulls":3},"Ovh 25% (IST / IST-ID)",{"$f":"+E24*0.25","v":0}]
{"$rows_left_out":26}
{"sheet":"A. Personnel","index":2,"n_rows":83,"n_cols":13,"rows_kept":83,"merged":[[0,0,3,0],[0,1,0,2],[0,5,3,8],[1,1,1,2],[2,1,2,2],[3,1,3,2]]}
["Personnel Costs","Docentes e investigadores do quadro de pessoal",null,"Imputação horária",null,"No HE os custos de pessoal, durante a execução do projeto, são calculados com base diária ([vencimento annual+encargos sociais]/215dias). Para efeito de candidatura mantém o cálculo com base nos PM’s."]
[null,"Investigadores contratados pelo projeto",null,"Apenas IST-ID"]
[null,"Bolseiros"]
[null,"In-Kind contributions (se aplicável)",null,"Third Party Agreement (cedência recursos humanos do IST à IST-ID))"]
[]
[]
{"$rows_left_out":78}
{"sheet":"C. Purchase","index":3,"n_rows":35,"n_cols":8,"rows_kept":35,"merged":[[3,4,3,6],[4,4,4,6],[5,4,5,6],[6,4,6,6],[7,4,7,6],[8,4,8,6],[11,5,11,6],[12,5,12,6],[13,5,13,6],[14,5,14,6],[15,5,15,6],[18,2,18,6],[19,2,19,6],[20,2,20,6],[21,2,21,6],[22,2,22,6],[23,2,23,6],[24,2,24,6],[25,2,25,6],[26,2,26,6],[27,2,27,6],[28,2,28,6],[29,2,29,6]]}
[]
[]
["C. Purchase costs *"]
["C1. Travel and Subsistence","Average Cost","Meetings/Travel","Total Cost","Description"]
[{"$nulls":3},{"$f":"+B5*C5","v":{"v":0,"d":"0.00"}}]
[{"$nulls":3},{"$f":"+B6*C6","v":{"v":0,"d":"0.00"}}]
{"$rows_left_out":30}
{"sheet":"C2. Equipment IST","index":4,"n_rows":69,"n_cols":15,"rows_kept":69,"merged":[[0,2,0,3],[3,2,3,4],[4,2,4,3],[6,5,6,8],[7,5,9,7],[8,2,8,3],[10,2,10,3],[11,2,11,3],[68,2,76,7]]}
[null,null,"Enter values in yellow cells only",{"$nulls":4},"Duration (months)",{"$f":"IF('Proposal Budget'!D7<>\"\",'Proposal Budget'!D7,\"\")","v":""}]
[]
[]
[]
[null,null,"Equipment Cost (Total cost):"]
[]
{"$rows_left_out":57}
{"sheet":"C2. Equip. IST-ID","index":5,"n_rows":69,"n_cols":15,"rows_kept":69,"merged":[[0,2,0,3],[4,2,4,3],[6,5,6,8],[8,2,8,3],[10,2,10,3],[11,2,11,3],[68,2,71,7]]}
[null,null,"Enter values in yellow cells only",{"$nulls":4},"Duration (months)",{"$f":"IF('Proposal Budget'!D7<>\"\",'Proposal Budget'!D7,\"\")","v":""}]
[]
[]
[]
[null,null,"Equipment Cost (Total cost):"]
[]
{"$rows_left_out":57}
{"sheet":"Teachers & Researchers","index":6,"n_rows":30,"n_cols":15,"rows_kept":30,"merged":[[1,0,2,0],[1,1,1,12],[2,1,2,3],[2,4,2,6],[2,7,2,9],[2,10,2,12],[4,0,5,0],[6,0,7,0],[8,0,9,0],[10,0,11,0],[12,0,13,0],[14,0,15,0],[16,0,17,0],[18,0,19,0],[20,0,21,0],[22,0,23,0],[24,0,25,0],[26,0,27,0],[28,0,29,0]]}
[2025,{"$nulls":13},"1 PM = (Vencimento anual + Encargos sociais da entidade patronal) / 11"]
["CATEGORIA","ESCALÃO",{"$nulls":12},"1 PM = 144,45 horas"]
[null,1,null,null,2,null,null,3,null,null,4,{"$nulls":3},"Horas produtivas anuais = 1589"]
[null,"VB","Hourly rate","Custo PM","VB","Hourly rate","Custo PM","VB","Hourly rate","Custo PM","VB","Hourly rate","Custo PM"]
["Professor Catedrático",285,null,null,300,null,null,310,null,null,330]
[null,{"v":5117.26,"d":"€5,117.26"},{"$f":"+B6*1.2375*14/1610","v":{"v":55.06616739130435,"d":"€55.07"}},{"$f":"+C6*146.36","v":{"v":8059.484259391305,"d":"€8,059.48"}},{"v":5386.59,"d":"€5,386.59"},{"$f":"+E6*1.2375*14/1610","v":{"v":57.96439239130435,"d":"€57.96"}},{"$f":"+F6*146.36","v":{"v":8483.668470391305,"d":"€8,483.67"}},{"v":5566.13,"d":"€5,566.13"},{"$f":"+H6*1.2375*14/1610","v":{"v":59.89639891304348,"d":"€59.90"}},{"$f":"+I6*146.36","v":{"v":8766.436944913044,"d":"€8,766.44"}},{"v":5925.25,"d":"€5,925.25"},{"$f":"+K6*1.2375*14/1610","v":{"v":63.76084239130435,"d":"€63.76"}},{"$f":"+L6*146.36","v":{"v":9332.036892391307,"d":"€9,332.04"}}]
{"$rows_left_out":25}
{"sheet":"Post docs","index":7,"n_rows":23,"n_cols":11,"rows_kept":23,"merged":[[0,0,0,1],[1,0,1,9],[16,0,16,2],[18,0,19,2]]}
["Campo de seleção/preenchimento",null,2025]
["Cálculo custos com a contratação de Investigadores doutorados (Post Docs)"]
["Preencher Venc. base mens.",{"v":2459.95,"d":"2,459.95 €"}]
["Índice",{"$f":"VLOOKUP(B5,'Ph.D. Salary level'!$H$4:$I$53,2,FALSE)","v":35},"Observações","Valor  12 m","Valor 15m","Valor  18 m","Valor  20 m","Valor 24 m","Valor 30 m","Valor 36 m","Valor 60 m"]
["Vencimento base mensal",{"$f":"B3","v":{"v":2459.95,"d":"2,459.95 €"}},"Nível remuneratório",{"$f":"B5*12","v":{"v":29519.399999999998,"d":"29,519.40 €"}},{"$f":"B5*15","v":{"v":36899.25,"d":"36,899.25 €"}},{"$f":"B5*18","v":{"v":44279.1,"d":"44,279.10 €"}},{"$f":"B5*20","v":{"v":49199,"d":"49,199.00 €"}},{"$f":"B5*24","v":{"v":59038.799999999996,"d":"59,038.80 €"}},{"$f":"B5*30","v":{"v":73798.5,"d":"73,798.50 €"}},{"$f":"B5*36","v":{"v":88558.2,"d":"88,558.20 €"}},{"$f":"B5*60","v":{"v":147597,"d":"147,597.00 €"}}]
["Subsídio de refeição mensal",{"$f":"6*22","v":{"v":132,"d":"132.00 €"}},"22 dias uteis em média, variável mensalmente em função dos dias do mês/faltas/férias",{"$f":"B6*11","v":{"v":1452,"d":"1,452.00 €"}},{"$f":"B6*14","v":{"v":1848,"d":"1,848.00 €"}},{"$f":"B6*16+B6/2","v":{"v":2178,"d":"2,178.00 €"}},{"$f":"B6*18","v":{"v":2376,"d":"2,376.00 €"}},{"$f":"B6*22","v":{"v":2904,"d":"2,904.00 €"}},{"$f":"B6*28","v":{"v":3696,"d":"3,696.00 €"}},{"$f":"B6*33","v":{"v":4356,"d":"4,356.00 €"}},{"$f":"B6*55","v":{"v":7260,"d":"7,260.00 €"}}]
{"$rows_left_out":18}
{"sheet":"Other personnel","index":8,"n_rows":26,"n_cols":11,"rows_kept":26,"merged":[[1,0,1,9],[20,0,20,2],[23,3,24,9],[23,11,24,17]]}
[2025]
["Cálculo custos com a contratação - Carreira de TÉCNICO SUPERIOR"]
[]
["CATEGORIA","POSIÇÃO REMUNERATÓRIA","NÍVEL REMUNERATÓRIO DA TABELA ÚNICA","VALOR"]
["Técnico Superior",{"v":1,"d":"01"},"016",{"v":1442.57,"d":"€ 1,442.57"}]
[]
{"$rows_left_out":21}
{"sheet":"Scholarships","index":9,"n_rows":15,"n_cols":24,"rows_kept":15,"merged":[[1,0,1,22],[3,1,3,4],[3,5,3,8],[3,9,3,12],[3,13,3,16],[3,17,3,20],[6,23,7,23],[9,0,10,2],[9,22,10,22],[9,23,10,30]]}
["BOLSAS "]
["A atribuição de bolsas no âmbito dos projetos são objeto de concurso e contratualização por parte das entidades beneficiárias, nos termos do previsto no Estatuto do Bolseiro de Investigação (Lei n.º 40/2004, de 18 de agosto, na sua redação atual) e do Regulamento de Bolsas de Investigação da FCT."]
["Nota: Escolher o número de meses em cada ano de contrato e número total de bolseiros"]
[null,"Previsão custo 2025",{"$nulls":3},"Previsão custo 2026",{"$nulls":3},"Previsão custo 2027",{"$nulls":3},"Previsão custo 2028",{"$nulls":3},"Previsão custo 2029"]
["Tipo de bolsa","Valor mensal [tab regulada FCT*]","SSV + Seguro Ac. Pessoais *","Total","Nº meses","Valor mensal [tab regulada FCT*]","SSV + Seguro Ac. Pessoais *","Total","Nº meses","Valor mensal [tab regulada FCT*]","SSV + Seguro Ac. Pessoais *","Total","Nº meses","Valor mensal [previsão actualização]","SSV + Seguro Ac. Pessoais [Estimativa*]","Total","Nº meses","Valor mensal [previsão actualização]","SSV + Seguro Ac. Pessoais [Estimativa*]","Total","Nº meses","Nº bolseiros","Cálculo(a)","a) calcular o valor total da tipologia pelo nº de meses pretendido"]
["Atividades de I&D a realizar por doutorados (BIPD)",{"v":1851,"d":"1,851.00"},157.26,{"$f":"B6+C6","v":{"v":2008.26,"d":"2,008.26"}},0,{"$f":"+B6*1.03","v":{"v":1906.53,"d":"1,906.53"}},{"v":161.9778,"d":"161.98"},{"$f":"F6+G6","v":{"v":2068.5078,"d":"2,068.51"}},0,{"$f":"+F6*1.03","v":{"v":1963.7259,"d":"1,963.73"}},{"v":166.83713400000002,"d":"166.84"},{"$f":"J6+K6","v":{"v":2130.563034,"d":"2,130.56"}},0,{"$f":"+J6*1.03","v":{"v":2022.637677,"d":"2,022.64"}},{"$f":"+K6*1.03","v":{"v":171.84224802000003,"d":"171.84"}},{"$f":"N6+O6","v":{"v":2194.47992502,"d":"2,194.48"}},0,{"$f":"+N6*1.03","v":{"v":2083.31680731,"d":"2,083.32"}},{"v":176.99751546060003,"d":"177.00"},{"$f":"R6+S6","v":{"v":2260.3143227706,"d":"2,260.31"}},0,null,{"$f":"((D6*E6)+(H6*I6)+(L6*M6)+(P6*Q6)+(T6*U6))*V6","v":{"v":0,"d":"0.00"}},"A duração da BIPD é, em regra, anual, não podendo ser concedida por períodos inferiores a três meses consecutivos, sendo renovável até ao prazo máximo de três anos."]
{"$rows_left_out":10}
{"sheet":"Ph.D. Salary level","index":10,"n_rows":53,"n_cols":12,"rows_kept":53,"merged":[[2,1,2,2],[3,10,3,11]]}
[]
["Tabela remuneratória única"]
["Níveis remuneratórios/Montante pecuniário (euros)","Nível remuneratório (DL 57/2016)",null,"TRU\n2021","TRU\n2023","TRU 2024","TRU 2025","ATUAL","Nível TRU"]
["33 . . . . . . . . . . . . . . . . . . . . . . . . . . . . . . . . . 2 128,34",1,{"v":2128.34,"d":"2,128.34"},{"$f":"C4+(C4*0.003)","v":{"v":2134.7250200000003,"d":"2,134.73"}},{"v":2228.11,"d":"2,228.11"},{"v":2294.95,"d":"2,294.95"},{"v":2351.53,"d":"2,351.53"},{"$f":"+G4","v":{"v":2351.53,"d":"2,351.53"}},33,null,"DL 57/2016, artig nº 15º"]
["34 . . . . . . . . . . . . . . . . . . . . . . . . . . . . . . . . . 2 179,83",1,{"v":2179.83,"d":"2,179.83"},{"$f":"C5+(C5*0.003)","v":{"v":2186.36949,"d":"2,186.37"}},{"v":2280.73,"d":"2,280.73"},{"v":2349.15,"d":"2,349.15"},{"v":2405.73,"d":"2,405.73"},{"$f":"+G5","v":{"v":2405.73,"d":"2,405.73"}},34,null,"Nível 1 ","entre o nível 33 e 53"]
["35 . . . . . . . . . . . . . . . . . . . . . . . . . . . . . . . . . 2 231,32",1,{"v":2231.32,"d":"2,231.32"},{"v":2238.01396,"d":"2,238.01"},{"v":2333.37,"d":"2,333.37"},{"v":2403.37,"d":"2,403.37"},{"v":2459.95,"d":"2,459.95"},{"v":2459.95,"d":"2,459.95"},35,null,"Nível 2","entre o nível 37 e 53"]
{"$rows_left_out":48}
{"sheet":"Equipment Useful Life Table IST","index":11,"n_rows":1291,"n_cols":4,"rows_kept":1291,"merged":[[0,1,0,3],[1,1,1,3],[41,1,52,1],[41,3,52,3],[53,1,55,1],[53,3,55,3],[56,1,61,1],[56,3,61,3],[63,1,70,1],[63,3,70,3],[87,1,107,1],[87,3,107,3],[108,1,116,1],[108,3,116,3],[117,1,145,1],[117,3,145,3],[146,1,167,1],[146,3,167,3],[168,1,194,1],[168,3,194,3],[195,1,222,1],[195,3,222,3],[223,1,246,1],[223,3,246,3],[248,1,254,1],[248,3,254,3],[255,1,259,1],[255,3,259,3],[262,1,318,1],[262,3,318,3],[319,1,356,1],[319,3,356,3],[357,1,376,1],[357,3,376,3],[377,1,391,1],[377,3,391,3],[392,1,399,1],[392,3,399,3],[400,1,403,1],[400,3,403,3],[404,1,409,1],[404,3,409,3],[410,1,417,1],[410,3,417,3],[420,1,441,1],[420,3,441,3],[442,1,461,1],[442,3,461,3],[462,1,479,1],[462,3,479,3],[480,1,542,1],[480,3,542,3],[543,1,551,1],[543,3,551,3],[555,1,566,1],[555,3,566,3],[567,1,577,1],[567,3,577,3],[578,1,584,1],[578,3,584,3],[585,1,595,1],[585,3,595,3],[596,1,598,1],[596,3,598,3],[601,1,609,1],[601,3,609,3],[610,1,619,1],[610,3,619,3],[620,1,626,1],[620,3,626,3],[627,1,642,1],[627,3,642,3],[643,1,649,1],[643,3,649,3],[651,1,659,1],[651,3,659,3],[660,1,664,1],[660,3,664,3],[666,1,676,1],[666,3,676,3],[677,1,681,1],[677,3,681,3],[682,1,688,1],[682,3,688,3],[690,1,695,1],[690,3,695,3],[696,1,697,1],[696,3,697,3],[698,1,704,1],[698,3,704,3],[705,1,708,1],[705,3,708,3],[710,1,715,1],[710,3,715,3],[716,1,717,1],[716,3,717,3],[718,1,732,1],[718,3,732,3],[734,1,736,1],[734,3,736,3],[737,1,742,1],[737,3,742,3],[743,1,748,1],[743,3,748,3],[750,1,758,1],[750,3,758,3],[759,1,762,1],[759,3,762,3],[763,1,769,1],[763,3,769,3],[770,1,774,1],[770,3,774,3],[775,1,777,1],[775,3,777,3],[778,1,786,1],[778,3,786,3],[787,1,796,1],[787,3,796,3],[797,1,805,1],[797,3,805,3],[806,1,814,1],[806,3,814,3],[815,1,822,1],[815,3,822,3],[823,1,832,1],[823,3,832,3],[834,1,836,1],[834,3,836,3],[837,1,844,1],[837,3,844,3],[847,1,853,1],[847,3,853,3],[854,1,866,1],[854,3,866,3],[867,1,873,1],[867,3,873,3],[874,1,888,1],[874,3,888,3],[889,1,892,1],[889,3,892,3],[893,1,900,1],[893,3,900,3],[901,1,905,1],[901,3,905,3],[906,1,909,1],[906,3,909,3],[910,1,913,1],[910,3,913,3],[914,1,919,1],[914,3,919,3],[920,1,925,1],[920,3,925,3],[927,1,968,1],[927,3,968,3],[970,1,986,1],[970,3,986,3],[987,1,991,1],[987,3,991,3],[1018,1,1025,1],[1018,3,1025,3],[1026,1,1027,1],[1026,3,1027,3],[1034,1,1037,1],[1034,3,1037,3],[1039,1,1040,1],[1039,3,1040,3],[1049,1,1076,1],[1049,3,1076,3],[1077,1,1099,1],[1077,3,1099,3],[1102,1,1113,1],[1102,3,1113,3],[1114,1,1120,1],[1114,3,1120,3],[1121,1,1134,1],[1121,3,1134,3],[1142,1,1147,1],[1142,3,1147,3],[1151,1,1177,1],[1151,3,1177,3],[1178,1,1184,1],[1178,3,1184,3],[1185,1,1205,1],[1185,3,1205,3],[1206,1,1211,1],[1206,3,1211,3],[1212,1,1226,1],[1212,3,1226,3],[1227,1,1241,1],[1227,3,1241,3],[1244,1,1253,1],[1244,3,1253,3],[1254,1,1267,1],[1254,3,1267,3],[1268,1,1272,1],[1268,3,1272,3],[1274,1,1276,1],[1274,3,1276,3],[1278,1,1282,1],[1278,3,1282,3]]}
[null,"7 — Classificador complementar 2 — Cadastro e vidas úteis dos ativos fixos tangíveis, intangíveis e propriedades de investimento"]
[42,"Diário da República, 1.ª série — N.º 178 — 11 de setembro de 2015"]
[420,"Código de Bens","Tipos de bens","Vida útil (Anos)"]
[4201,42,"42 Propriedades de investimento","Escolha sub-categoria"]
[4202,420,"420 Bens de domínio público","Escolha sub-categoria"]
[4209,4201,"Terrenos e recursos naturais*","–"]
{"$rows_left_out":1286}
{"sheet":"Equip. Useful Life Table IST-ID","index":12,"n_rows":162,"n_cols":7,"rows_kept":162,"merged":[[0,1,0,6],[1,0,3,0],[1,1,2,2],[1,3,2,3],[1,4,2,4],[1,5,1,6],[3,1,3,6],[23,1,23,6],[53,1,53,6],[111,1,111,6],[128,1,128,6],[157,1,157,6]]}
[null,"DEPRECIATION TABLE FOR EQUIPMENTS IST-ID"]
["Coluna de apoio ocultada, não utilizar","EQUIPMENT CODE",null,"TYPE","EQUIPMENT DESCRIPTION","USEFUL LIFE"]
[{"$nulls":5},"YEARS","TAXA"]
[null,"GRUPO 1 - IMÓVEIS"]
[20050001,20050001,"EDIFICAÇÕES LIGEIRAS",2005,"EDIFICACOES LIGEIRAS (FIBROC.,MAD., ETC)",10,10]
[20100001,20100001,"HABITACIONAIS",2010,"EDIFICIOS HABITACIONAIS",50,2]
{"$rows_left_out":157}
{"sheet":"Cálculo Seg. acidentes trabalho","index":13,"n_rows":20,"n_cols":20,"rows_kept":20,"hidden":true,"merged":[[0,3,0,7],[0,9,0,13],[0,15,0,19],[1,3,1,7],[1,9,1,13],[1,15,1,19],[11,15,11,19]]}
["Cálculo da massa salarial do trabalhor",null,null,"Valor do seguro de acidentes de trabalho ",{"$nulls":5},"Valor do seguro de acidentes de trabalho ",{"$nulls":5},"Valor do seguro de acidentes de trabalho "]
[null,"Valor",null,"(Novembro)",{"$nulls":5},"(Junho)",{"$nulls":5},"(Janeiro a Maio, Julho a Outubro e Dezembro)"]
["Vencimento base mensal",{"$f":"'Post docs'!B5","v":{"v":2459.95,"d":"2,459.95 €"}},{"$nulls":5},"Valor ",{"$nulls":5},"Valor ",{"$nulls":5},"Valor "]
["Subsídio alimentação (média 22 dias/mês)",{"$f":"4.52*22","v":{"v":99.44,"d":"99.44 €"}},null,"Total da massa salarial",1,null,null,{"$f":"B8","v":{"v":3891.8629166666665,"d":"3,891.86 €"}},null,"Total da massa salarial",1,null,null,{"$f":"B9","v":{"v":5121.837916666666,"d":"5,121.84 €"}},null,"Total da massa salarial",1,null,null,{"$f":"B10","v":{"v":2661.8879166666666,"d":"2,661.89 €"}}]
["Subsídio férias (Junho)",{"$f":"B3","v":{"v":2459.95,"d":"2,459.95 €"}},null,"Taxa do contrato",2,{"v":0.004,"d":"0.400%"},{"$nulls":3},"Taxa do contrato",2,{"v":0.004,"d":"0.400%"},{"$nulls":3},"Taxa do contrato",2,{"v":0.004,"d":"0.400%"}]
["Subsídio natal (1/24 avos)",{"$f":"B3/24","v":{"v":102.49791666666665,"d":"102.50 €"}},null,"Prémio comercial",3,null,"3=1*2",{"$f":"H4*F5","v":{"v":15.567451666666667,"d":"15.57 €"}},null,"Prémio comercial",3,null,"3=1*2",{"$f":"N4*L5","v":{"v":20.487351666666665,"d":"20.49 €"}},null,"Prémio comercial",3,null,"3=1*2",{"$f":"T4*R5","v":{"v":10.647551666666667,"d":"10.65 €"}}]
{"$rows_left_out":15}
{"sheet":"Cálculo Seg. acidentes trab","index":14,"n_rows":31,"n_cols":20,"rows_kept":31,"hidden":true,"merged":[[1,3,1,7],[1,9,1,13],[1,15,1,19],[2,3,2,7],[2,9,2,13],[2,15,2,19],[18,3,18,7],[18,9,18,13],[18,15,18,19],[19,3,19,7],[19,9,19,13],[19,15,19,19]]}
["Contrato Investigador Carreira "]
["Cálculo da massa salarial do trabalhor",null,null,"Valor do seguro de acidentes de trabalho ",{"$nulls":5},"Valor do seguro de acidentes de trabalho ",{"$nulls":5},"Valor do seguro de acidentes de trabalho "]
[null,"Valor",null,"(Novembro)",{"$nulls":5},"(Junho)",{"$nulls":5},"(Janeiro a Maio, Julho a Outubro e Dezembro)"]
["Vencimento base mensal",{"$f":"#REF!","v":{"$error":"#REF!"}},{"$nulls":5},"Valor ",{"$nulls":5},"Valor ",{"$nulls":5},"Valor "]
["Subsídio alimentação (média 22 dias/mês)",{"$f":"4.52*22","v":{"v":99.44,"d":"99.44 €"}},null,"Total da massa salarial",1,null,null,{"$f":"B9","v":{"$error":"#REF!"}},null,"Total da massa salarial",1,null,null,{"$f":"B10","v":{"$error":"#REF!"}},null,"Total da massa salarial",1,null,null,{"$f":"B11","v":{"$error":"#REF!"}}]
["Subsídio férias (Junho)",{"$f":"B4","v":{"$error":"#REF!"}},null,"Taxa do contrato",2,{"v":0.004,"d":"0.400%"},{"$nulls":3},"Taxa do contrato",2,{"v":0.004,"d":"0.400%"},{"$nulls":3},"Taxa do contrato",2,{"v":0.004,"d":"0.400%"}]
{"$rows_left_out":25}