{"text_format":"3","workbook":"xlsx","n_sheets":15,"sheets":["Admin Info","Proposal Budget","A. Personnel","C. Purchase","C2. Equipment IST","C2. Equip. IST-ID","Teachers & Researchers","Post docs","Other personnel","Scholarships","Ph.D. Salary level","Equipment Useful Life Table IST","Equip. Useful Life Table IST-ID","Cálculo Seg. acidentes trabalho","Cálculo Seg. acidentes trab"],"not_rendered":{"images":18,"defined_names":28},"read":"whole","date_system":"1900"}

{"sheet":"Admin Info","index":0,"n_rows":21,"n_cols":5,"rows_kept":21,"merged":[[1,1,2,1],[1,2,1,3],[2,2,2,3],[8,1,8,3],[9,4,9,6],[13,2,13,3],[13,4,13,5],[14,2,14,3],[14,4,14,5],[18,2,18,3],[20,2,20,3]]}
[]
[null,"PIC NUMBER (Participant Identification Code)","IST -  Instituto Superior Técnico",null,999992983]
[null,null,"IST-ID Associação do Instituto Superior Técnico para a Investigação e Desenvolvimento",null,954983722]
[]
[null,"Folha de cálculo elaborado por:","NPI, DP"]
[]
[null,"Contacto administrativo (Responsável pelo NPI)","Margarida Suárez","margarida.suarez@tecnico.ulisboa.pt","+351 21 841 98 63"]
[]
[null,"Este orçamento tem de ser enviado para o NPI, para verificação da viabilidade financeira do projeto"]
[{"$nulls":3},"Horizonte Europa Pilar 2","até 1 semana antes do deadline da call"]
[{"$nulls":3},"Pathfinder, Pathfinder Challenges, Transition, ERC","até 2 semanas antes do deadline da call"]
[]
[]
["Participant","Participation model","context",null,"Form"]
["IST-ID","Third Party Agreement with IST","when human resources of IST apply to projects through IST-ID",null,"Fill in Table 3.1j"]
[]
[]
[]
[null,"Gender Equality Plan (GEP) IST","https://tecnico.ulisboa.pt/en/campus-life/living-at-tecnico/diversity-and-gender-balance/"]
[]
[null,"Gender Equality Plan (GEP) IST-ID","https://ist-id.pt/plano-de-igualdade-de-genero/"]

{"sheet":"Proposal Budget","index":1,"n_rows":31,"n_cols":7,"rows_kept":31,"merged":[[0,0,0,3],[2,1,2,2],[3,1,3,2],[4,1,4,2],[5,1,5,2],[6,1,6,2],[7,1,7,2],[9,0,23,0],[9,1,23,1],[9,2,9,3],[10,2,10,3],[11,2,13,2],[14,2,21,2],[22,2,22,3],[23,2,23,3],[24,0,30,0],[24,1,26,1],[24,2,26,2],[27,2,27,3],[28,1,29,1],[28,2,28,3],[29,2,29,3],[30,1,30,3],[33,0,33,3]]}
["Enter values in yellow cells only",{"$nulls":4},"BUDGET FEASIBILITY"]
[{"$nulls":5},"Time allocation",{"$f":"+'A. Personnel'!D26","v":0}]
[null,"Call",{"$nulls":3},"Real costs",{"$f":"SUM(E10:E22)-G2","v":0}]
[null,"Beneficiary",null,null,"(dropdown)","Non Elegible Equipment Costs",{"$f":"+'C. Purchase'!E17","v":0}]
[null,"Acronym",{"$nulls":3},"Other Non Elegible Costs"]
[null,"Proposal reference",{"$nulls":3},"Ovh 25% (IST / IST-ID)",{"$f":"+E24*0.25","v":0}]
[null,"Duration in months",{"$nulls":3},{"$f":"IF(G7>=0,\"VIÁVEL\",\"NÃO VIÁVEL\")","v":"VIÁVEL"},{"$f":"E26-G3-G4-G5-G6","v":0}]
[null,"Principal Investigator (PI)"]
["BUDGET"]
["Estimated expenditure","Estimated eligible costs","A. Personnel costs/€  (a1)",null,{"$f":"+'A. Personnel'!B81","v":0}]
[null,null,"B. Subcontracting costs/€  (b)"]
[null,null,"C. Purchase costs","C.1 Travel and subsistence/€  (c1)",{"$f":"+'C. Purchase'!D10","v":0}]
[{"$nulls":3},"C.2 Equipment/€  (c2)",{"$f":"'C. Purchase'!D17","v":0},"Only eligible costs (according to national rules)"]
[{"$nulls":3},"C.3 Other goods, works and services/€  (c3)",{"$f":"+'C. Purchase'!B31","v":0},"including CFS (Certificate on the Financial Statements): only at final payment, if threshold is reached Standard threshold (beneficiary-level): - financial statement: requested EU contribution to costs ≥ EUR 430 000 Special threshold for beneficiaries with a systems and process audit (see Article 24): financial statement: requested EU contribution to costs ≥ EUR 725 000"]
[null,null,"D. Other costs categories","D.1 Financial support to third parties (Actual costs) (d1)"]
[{"$nulls":3},"D.2 Internally invoiced goods and services (Unit costs -usual accounting practices) (d2)"]
[{"$nulls":3},"D.3 Transnation al access to research infrastructures (Unit costs) (d3) ",null,"(OPTION for all HE and Euratom ToA (except HE IA, HE PCP/PPI, HE ERC Grants, HE EIC Grants and HE EIT KIC Actions)"]
[{"$nulls":3},"D.4 Virtual access to research infrastructures (Unit costs) (d4)",null,"(OPTION for all HE and Euratom ToA (except HE IA, HE PCP/PPI, HE ERC Grants, HE EIC Grants and HE EIT KIC Actions)"]
[{"$nulls":3},"D.5 PCP/PPI procurement costs (Actual costs) (d5)",null,"(OPTION for HE PCP/PPI)"]
[{"$nulls":3},"D.6 Euratom Cofund staff mobility costs (Unit costs) (d6)",null,"(OPTION for Euratom Programme Cofund Actions)"]
[{"$nulls":3},"D.7 ERC additional funding (Actual costs) (d7)",null,"(OPTION for HE ERC Grants)"]
[{"$nulls":3},"D.8 ERC additional funding (subcontracting, FSTP and internal invoiced goods and services) (Actual costs) (d8)",null,"(OPTION for HE ERC Grants)"]
[null,null,"E. indirect costs/€  (e) = (F28)%* [(a1)+(c1)+(c2)+(c3)+(dx)",null,{"$f":"F23*(E10+E12+E13+E14+E21)","v":0},{"v":0.25,"d":"25%"}]
[null,null,"Total eligible costs (h)=(a1)+(b)+(c1)+(c2)+(c3)+(d)+(e)",null,{"$f":"+SUM(E10:E23)","v":0}]
["Estimated income","Requested EU contribution","EU contribution to eligible costs","Funding rate % (U)",{"v":1,"d":"100%"}]
[{"$nulls":3},"Maximum EU contribution to eligible costs (l)=(U)*(h)",{"$f":"+E24*E25","v":0}]
[{"$nulls":3},"Requested EU contribution to eligible costs/€ (Requested grant amount)  (m)",{"$f":"+E26","v":0}]
[null,"Revenues","Income generated by the action (n)"]
[null,"Other sources of funding","Financial contributions (o)"]
[null,null,"Own resources (p)"]
[null,"Total estimated income (q)=(m)+(n)+(o)+(p)",null,null,{"$f":"+SUM(E27,E28,E29,E30)","v":0}]

{"sheet":"A. Personnel","index":2,"n_rows":83,"n_cols":13,"rows_kept":83,"merged":[[0,0,3,0],[0,1,0,2],[0,5,3,8],[1,1,1,2],[2,1,2,2],[3,1,3,2]]}
["Personnel Costs","Docentes e investigadores do quadro de pessoal",null,"Imputação horária",null,"No HE os custos de pessoal, durante a execução do projeto, são calculados com base diária ([vencimento annual+encargos sociais]/215dias). Para efeito de candidatura mantém o cálculo com base nos PM’s."]
[null,"Investigadores contratados pelo projeto",null,"Apenas IST-ID"]
[null,"Bolseiros"]
[null,"In-Kind contributions (se aplicável)",null,"Third Party Agreement (cedência recursos humanos do IST à IST-ID))"]
[]
[]
["Docentes com imputação horária",{"$nulls":4},"Bolseiros a contratar",{"$nulls":4},"Outros contratos "]
["Nome","Categoria","PM","Custo",null,"Bolsa","Meses de contrato","PM","Custo",null,"Tipo de contrato","PM","Custo"]
[{"$nulls":3},{"$f":"IFERROR(C9*VLOOKUP(B9,$A$34:$D$58,4,FALSE),0)","v":{"v":0,"d":"0.00"}},{"$nulls":3},{"$f":"+G9","v":0},{"$f":"IFERROR(G9*VLOOKUP(F9,$A$30:$D$33,4,FALSE),0)","v":{"v":0,"d":"0.00"}},null,null,{"$f":"IFERROR(VLOOKUP(K9,$F$30:$H$69,3,FALSE),0)","v":0},{"$f":"IFERROR(VLOOKUP(K9,$F$30:$H$69,2,FALSE),0)","v":{"v":0,"d":"0.00"}}]
[{"$nulls":3},{"$f":"IFERROR(C10*VLOOKUP(B10,$A$34:$D$58,4,FALSE),0)","v":{"v":0,"d":"0.00"}},{"$nulls":3},0,{"$f":"IFERROR(G10*VLOOKUP(F10,$A$30:$D$33,4,FALSE),0)","v":{"v":0,"d":"0.00"}},null,null,{"$f":"IFERROR(VLOOKUP(K10,$F$30:$H$69,3,FALSE),0)","v":0},{"v":0,"d":"0.00"}]
[{"$nulls":3},{"v":0,"d":"0.00"},{"$nulls":3},0,{"v":0,"d":"0.00"},null,null,{"$f":"IFERROR(VLOOKUP(K11,$F$30:$H$69,3,FALSE),0)","v":0},{"v":0,"d":"0.00"}]
[{"$nulls":3},{"v":0,"d":"0.00"},{"$nulls":3},0,{"v":0,"d":"0.00"},null,null,0,{"v":0,"d":"0.00"}]
[{"$nulls":3},{"v":0,"d":"0.00"},{"$nulls":3},0,{"v":0,"d":"0.00"},null,null,0,{"v":0,"d":"0.00"}]
[{"$nulls":3},{"v":0,"d":"0.00"},{"$nulls":3},0,{"v":0,"d":"0.00"},null,null,0,{"v":0,"d":"0.00"}]
[{"$nulls":3},{"v":0,"d":"0.00"},{"$nulls":3},0,{"v":0,"d":"0.00"},null,null,0,{"v":0,"d":"0.00"}]
[{"$nulls":3},{"v":0,"d":"0.00"},{"$nulls":3},0,{"v":0,"d":"0.00"},null,null,0,{"v":0,"d":"0.00"}]
[{"$nulls":3},{"v":0,"d":"0.00"},{"$nulls":3},0,{"v":0,"d":"0.00"},null,null,0,{"v":0,"d":"0.00"}]
[{"$nulls":3},{"v":0,"d":"0.00"},{"$nulls":3},0,{"v":0,"d":"0.00"},null,null,0,{"v":0,"d":"0.00"}]
[{"$nulls":3},{"v":0,"d":"0.00"},{"$nulls":3},0,{"v":0,"d":"0.00"},null,null,0,{"v":0,"d":"0.00"}]
[{"$nulls":3},{"v":0,"d":"0.00"},{"$nulls":3},0,{"v":0,"d":"0.00"},null,null,0,{"v":0,"d":"0.00"}]
[{"$nulls":3},{"v":0,"d":"0.00"},{"$nulls":3},0,{"v":0,"d":"0.00"},null,null,0,{"v":0,"d":"0.00"}]
[{"$nulls":3},{"v":0,"d":"0.00"},{"$nulls":3},0,{"v":0,"d":"0.00"},null,null,0,{"v":0,"d":"0.00"}]
[{"$nulls":3},{"v":0,"d":"0.00"},{"$nulls":3},0,{"v":0,"d":"0.00"},null,null,0,{"v":0,"d":"0.00"}]
[{"$nulls":3},{"v":0,"d":"0.00"},{"$nulls":3},0,{"v":0,"d":"0.00"},null,null,0,{"v":0,"d":"0.00"}]
[{"$nulls":3},{"v":0,"d":"0.00"},{"$nulls":3},0,{"v":0,"d":"0.00"},null,null,0,{"v":0,"d":"0.00"}]
["Total",null,{"$f":"+SUM(C9:C25)","v":0},{"$f":"SUM(D9:D25)","v":{"v":0,"d":"0.00"}},null,"Total",null,{"$f":"+SUM(H9:H25)","v":0},{"$f":"+SUM(I9:I25)","v":{"v":0,"d":"0.00"}},null,"total",{"$f":"+SUM(L9:L25)","v":0},{"$f":"+SUM(M9:M25)","v":{"v":0,"d":"0.00"}}]
[]
[]
["Tipo de bolsa","Valor mensal [tab regulada FCT]","SSV + Seguro Ac. Pessoais [Estimativa]","Custo PM",null,"Tipo/duração de contrato","Custo total","PM's"]
["Bolsa de Pós-Doutoramento  (BIPD)",{"v":1851,"d":"1,851.00 €"},{"v":157.26,"d":"157.26 €"},{"$f":"+B30+C30","v":{"v":2008.26,"d":"2,008.26 €"}},null,"Post-doc TRU 34 - 12 meses",{"v":54112.05,"d":"54,112.05"},12]
["Bolsa de Mestre (BI)",{"v":1309.64,"d":"1,309.64 €"},{"v":157.26,"d":"157.26 €"},{"$f":"+B31+C31","v":{"v":1466.9,"d":"1,466.90 €"}},null,"Post-doc TRU 34 - 15 meses",{"v":65415.24,"d":"65,415.24"},15]
["Bolsa de Licenciado (BI)",{"v":1040.98,"d":"1,040.98 €"},{"v":157.26,"d":"157.26 €"},{"$f":"+B32+C32","v":{"v":1198.24,"d":"1,198.24 €"}},null,"Post-doc TRU 34 - 18 meses",{"v":76652.44,"d":"76,652.44"},18]
["Bolsa de iniciação científica (BII)",{"v":651.12,"d":"651.12 €"},{"v":157.26,"d":"157.26 €"},{"$f":"+B33+C33","v":{"v":808.38,"d":"808.38 €"}},null,"Post-doc TRU 34 - 20 meses",{"v":84121.9,"d":"84,121.90"},20]
["Assistente - escalão 1",{"v":2523.37,"d":"2,523.37 €"},0,{"$f":"(B34*1.2375*14)/11","v":{"v":3974.30775,"d":"3,974.31 €"}},null,"Post-doc TRU 34 - 24 meses",{"v":99192.82,"d":"99,192.82"},24]
["Assistente - escalão 2",{"v":2609.53,"d":"2,609.53 €"},0,{"$f":"(B35*1.2375*14)/11","v":{"v":4110.00975,"d":"4,110.01 €"}},null,"Post-doc TRU 34 - 30 meses",{"v":121799.21,"d":"121,799.21"},30]
["Assistente - escalão 3",{"v":2783.88,"d":"2,783.88 €"},0,{"v":4384.611,"d":"4,384.61 €"},null,"Post-doc TRU 34 - 36 meses",{"v":144273.6,"d":"144,273.60"},36]
["Assistente Estagiário - escalão 1",{"v":1834.93,"d":"1,834.93 €"},0,{"v":2890.0147500000003,"d":"2,890.01 €"},null,"Post-doc TRU 34 - 60 meses",{"v":234435.15,"d":"234,435.15"},60]
["Assistente Estagiário - escalão 2",{"v":2006.38,"d":"2,006.38 €"},0,{"v":3160.0485,"d":"3,160.05 €"},null,"Post-doc TRU 38 - 12 meses",{"v":58849.3,"d":"58,849.30"},12]
["Professor Associado - escalão 1",{"v":3950.17,"d":"3,950.17 €"},0,{"v":6221.51775,"d":"6,221.52 €"},null,"Post-doc TRU 38 - 15 meses",{"v":71135.53,"d":"71,135.53"},15]
["Professor Associado - escalão 2",{"v":4129.71,"d":"4,129.71 €"},0,{"v":6504.29325,"d":"6,504.29 €"},null,"Post-doc TRU 38 - 18 meses",{"v":83355.77,"d":"83,355.77"},18]
["Professor Associado - escalão 3",{"v":4488.84,"d":"4,488.84 €"},0,{"v":7069.923000000001,"d":"7,069.92 €"},null,"Post-doc TRU 38 - 20 meses",{"v":91480.59,"d":"91,480.59"},20]
["Professor Associado - escalão 4",{"v":4668.39,"d":"4,668.39 €"},0,{"v":7352.714250000001,"d":"7,352.71 €"},null,"Post-doc TRU 38 - 24 meses",{"v":107862.23,"d":"107,862.23"},24]
["Professor Associado com Agregação - escalão 1",{"v":4399.05,"d":"4,399.05 €"},0,{"v":6928.503750000001,"d":"6,928.50 €"},null,"Post-doc TRU 38 - 30 meses",{"v":132434.7,"d":"132,434.70"},30]
["Professor Associado com Agregação - escalão 3",{"v":4758.17,"d":"4,758.17 €"},0,{"v":7494.117749999999,"d":"7,494.12 €"},null,"Post-doc TRU 38 - 36 meses",{"v":156875.17,"d":"156,875.17"},36]
["Professor Associado com Agregação - escalão 4",{"v":5117.26,"d":"5,117.26 €"},0,{"v":8059.6845,"d":"8,059.68 €"},null,"Post-doc TRU 38 - 60 meses",{"v":254901.03,"d":"254,901.03"},60]
["Professor Associado com Agregação - escalão 2",{"v":4578.61,"d":"4,578.61 €"},0,{"v":7211.310750000001,"d":"7,211.31 €"},null,"Post-doc TRU 44 - 12 meses",{"v":66133.21,"d":"66,133.21"},12]
["Professor Auxiliar - escalão 1",{"v":3501.28,"d":"3,501.28 €"},0,{"v":5514.5160000000005,"d":"5,514.52 €"},null,"Post-doc TRU 44 - 15 meses",{"v":79930.95,"d":"79,930.95"},15]
["Professor Auxiliar - escalão 2",{"v":3770.6,"d":"3,770.60 €"},0,{"v":5938.695000000001,"d":"5,938.70 €"},null,"Post-doc TRU 44 - 18 meses",{"v":93662.68,"d":"93,662.68"},18]
["Professor Auxiliar - escalão 3",{"v":4129.71,"d":"4,129.71 €"},0,{"v":6504.29325,"d":"6,504.29 €"},null,"Post-doc TRU 44 - 20 meses",{"v":102795.17,"d":"102,795.17"},20]
["Professor Auxiliar - escalão 4",{"v":4399.05,"d":"4,399.05 €"},0,{"v":6928.503750000001,"d":"6,928.50 €"},null,"Post-doc TRU 44 - 24 meses",{"v":121192.16,"d":"121,192.16"},24]
["Professor Auxiliar com Agregação - escalão 1",{"v":3950.17,"d":"3,950.17 €"},0,{"v":6221.51775,"d":"6,221.52 €"},null,"Post-doc TRU 44 - 30 meses",{"v":148787.63,"d":"148,787.63"},30]
["Professor Auxiliar com Agregação - escalão 2",{"v":4129.71,"d":"4,129.71 €"},0,{"v":6504.29325,"d":"6,504.29 €"},null,"Post-doc TRU 44 - 36 meses",{"v":176251.11,"d":"176,251.11"},36]
["Professor Auxiliar com Agregação - escalão 3",{"v":4488.84,"d":"4,488.84 €"},0,{"v":7069.923000000001,"d":"7,069.92 €"},null,"Post-doc TRU 44 - 60 meses",{"v":286369,"d":"286,369.00"},60]
["Professor Auxiliar com Agregação - escalão 4",{"v":4668.39,"d":"4,668.39 €"},0,{"v":7352.714250000001,"d":"7,352.71 €"},null,"Post-doc TRU 49 - 12 meses",{"v":72302.38,"d":"72,302.38"},12]
["Professor Catedrático - escalão 1",{"v":5117.26,"d":"5,117.26 €"},0,{"v":8059.6845,"d":"8,059.68 €"},null,"Post-doc TRU 49 - 15 meses",{"v":87380.3,"d":"87,380.30"},15]
["Professor Catedrático - escalão 2",{"v":5386.59,"d":"5,386.59 €"},0,{"v":8483.87925,"d":"8,483.88 €"},null,"Post-doc TRU 49 - 18 meses",{"v":102392.22,"d":"102,392.22"},18]
["Professor Catedrático - escalão 3",{"v":5566.13,"d":"5,566.13 €"},0,{"v":8766.65475,"d":"8,766.65 €"},null,"Post-doc TRU 49 - 20 meses",{"v":112378.17,"d":"112,378.17"},20]
["Professor Catedrático - escalão 4",{"v":5925.25,"d":"5,925.25 €"},0,{"v":9332.268750000001,"d":"9,332.27 €"},null,"Post-doc TRU 49 - 24 meses",{"v":132482.06,"d":"132,482.06"},24]
["Estagiário de investigação - escalão 1",{"v":1834.93,"d":"1,834.93 €"},0,{"v":2890.0147500000003,"d":"2,890.01 €"},null,"Post-doc TRU 49 - 30 meses",{"v":162637.89,"d":"162,637.89"},30]
["Estagiário de investigação - escalão 2",{"v":2006.38,"d":"2,006.38 €"},0,{"v":3160.0485,"d":"3,160.05 €"},null,"Post-doc TRU 49 - 36 meses",{"v":192661.73,"d":"192,661.73"},36]
["Assistente de investigação - escalão 1",{"v":2523.37,"d":"2,523.37 €"},0,{"v":3974.30775,"d":"3,974.31 €"},null,"Post-doc TRU 49 - 60 meses",{"v":313021.08,"d":"313,021.08"},60]
["Assistente de investigação - escalão 2",{"v":2609.53,"d":"2,609.53 €"},0,{"v":4110.00975,"d":"4,110.01 €"},null,"Técnico superior 12 meses",{"v":33058.72,"d":"33,058.72"},12]
["Assistente de investigação - escalão 3",{"v":2783.88,"d":"2,783.88 €"},0,{"v":4384.611,"d":"4,384.61 €"},null,"Técnico superior 15 meses",{"v":40022.51,"d":"40,022.51"},15]
["Investigador auxiliar - escalão 1",{"v":3501.28,"d":"3,501.28 €"},0,{"v":5514.5160000000005,"d":"5,514.52 €"},null,"Técnico superior 18 meses",{"v":46860.3,"d":"46,860.30"},18]
["Investigador auxiliar - escalão 2",{"v":3770.6,"d":"3,770.60 €"},0,{"v":5938.695000000001,"d":"5,938.70 €"},null,"Técnico superior 20 meses",{"v":51416.83,"d":"51,416.83"},20]
["Investigador auxiliar - escalão 3",{"v":4129.71,"d":"4,129.71 €"},0,{"v":6504.29325,"d":"6,504.29 €"},null,"Técnico superior 24 meses",{"v":60661.89,"d":"60,661.89"},24]
["Investigador auxiliar - escalão 4",{"v":4399.05,"d":"4,399.05 €"},0,{"v":6928.503750000001,"d":"6,928.50 €"},null,"Técnico superior 30 meses",{"v":74529.48,"d":"74,529.48"},30]
["Investigador principal / Investigador auxiliar com habilitação ou agregação - escalão 1",{"v":3950.17,"d":"3,950.17 €"},0,{"v":6221.51775,"d":"6,221.52 €"},null,"Técnico superior 36 meses",{"v":88265.07,"d":"88,265.07"},36]
["Investigador principal / Investigador auxiliar com habilitação ou agregação - escalão 2",{"v":4129.71,"d":"4,129.71 €"},0,{"v":6504.29325,"d":"6,504.29 €"},null,"Técnico superior 60 meses",{"v":143471.42,"d":"143,471.42"},60]
["Investigador principal / Investigador auxiliar com habilitação ou agregação - escalão 3",{"v":4488.84,"d":"4,488.84 €"},0,{"v":7069.923000000001,"d":"7,069.92 €"}]
["Investigador principal / Investigador auxiliar com habilitação ou agregação - escalão 4",{"v":4668.39,"d":"4,668.39 €"},0,{"v":7352.714250000001,"d":"7,352.71 €"}]
["Investigador principal com habilitação ou agregação - escalão 1",{"v":4399.05,"d":"4,399.05 €"},0,{"v":6928.503750000001,"d":"6,928.50 €"}]
["Investigador principal com habilitação ou agregação - escalão 2",{"v":4578.61,"d":"4,578.61 €"},0,{"v":7211.310750000001,"d":"7,211.31 €"}]
["Investigador principal com habilitação ou agregação - escalão 3",{"v":4758.17,"d":"4,758.17 €"},0,{"v":7494.117749999999,"d":"7,494.12 €"}]
["Investigador principal com habilitação ou agregação - escalão 4",{"v":5117.26,"d":"5,117.26 €"},0,{"v":8059.6845,"d":"8,059.68 €"}]
["Investigador coordenador - escalão 1",{"v":5117.26,"d":"5,117.26 €"},0,{"v":8059.6845,"d":"8,059.68 €"}]
["Investigador coordenador - escalão 2",{"v":5386.59,"d":"5,386.59 €"},0,{"v":8483.87925,"d":"8,483.88 €"}]
["Investigador coordenador - escalão 3",{"v":5566.13,"d":"5,566.13 €"},0,{"v":8766.65475,"d":"8,766.65 €"}]
["Investigador coordenador - escalão 4",{"v":5925.25,"d":"5,925.25 €"},0,{"v":9332.268750000001,"d":"9,332.27 €"}]
["Total PM",{"$f":"+C26+H26+L26","v":0}]
["Total €",{"$f":"+D26+I26+M26","v":0}]
[]
["Técnico superior doutorado: 1.915,46 €"]

{"sheet":"C. Purchase","index":3,"n_rows":35,"n_cols":8,"rows_kept":35,"merged":[[3,4,3,6],[4,4,4,6],[5,4,5,6],[6,4,6,6],[7,4,7,6],[8,4,8,6],[11,5,11,6],[12,5,12,6],[13,5,13,6],[14,5,14,6],[15,5,15,6],[18,2,18,6],[19,2,19,6],[20,2,20,6],[21,2,21,6],[22,2,22,6],[23,2,23,6],[24,2,24,6],[25,2,25,6],[26,2,26,6],[27,2,27,6],[28,2,28,6],[29,2,29,6]]}
[]
[]
["C. Purchase costs *"]
["C1. Travel and Subsistence","Average Cost","Meetings/Travel","Total Cost","Description"]
[{"$nulls":3},{"$f":"+B5*C5","v":{"v":0,"d":"0.00"}}]
[{"$nulls":3},{"$f":"+B6*C6","v":{"v":0,"d":"0.00"}}]
[{"$nulls":3},{"$f":"+B7*C7","v":{"v":0,"d":"0.00"}}]
[{"$nulls":3},{"$f":"+B8*C8","v":{"v":0,"d":"0.00"}}]
[{"$nulls":3},{"$f":"B9*C9","v":{"v":0,"d":"0.00"}}]
[null,null,"Total",{"$f":"SUM(D5:D9)","v":{"v":0,"d":"0.00"}}]
[]
["C2. Equipment\n[Please use sheet \"C2. Equipment\" to calculate\nEligible (column E) and Ineligible (column F) costs]","Total Cost","Depreciation/years","Elegible Cost","Non Elegible Cost","Description"]
[{"$nulls":7},{"$f":"IFERROR(IF((D13+E13)=B13,\"ok\",\"error\"),0)","v":"ok"}]
[{"$nulls":7},{"$f":"IFERROR(IF((D14+E14)=B14,\"ok\",\"error\"),0)","v":"ok"}]
[{"$nulls":7},{"$f":"IFERROR(IF((D15+E15)=B15,\"ok\",\"error\"),0)","v":"ok"}]
[{"$nulls":7},{"$f":"IFERROR(IF((D16+E16)=B16,\"ok\",\"error\"),0)","v":"ok"}]
[null,null,"Total",{"$f":"SUM(D13:D16)","v":{"v":0,"d":"0.00"}},{"$f":"SUM(E13:E16)","v":{"v":0,"d":"0.00"}}]
[]
["C3. Other goods, works and services","Total Cost","Description"]
["Consumables"]
["Conference Fees"]
["Conference organisation"]
["Dissemination Costs"]
["CFS"]
["Analysis"]
["Reagents"]
["Publications"]
["Software licences"]
["Patents"]
["Other"]
["Total",{"$f":"SUM(B20:B30)","v":{"v":0,"d":"0.00"}}]
[]
[]
[]
["* Note: when purchasing equipment, instruments and reagents used in R&D activities, VAT will be refunded by AT (Portuguese Tax Authority). In this cases VAT will not be a cost for the project, and should not be included in the budget."]

{"sheet":"C2. Equipment IST","index":4,"n_rows":69,"n_cols":15,"rows_kept":69,"merged":[[0,2,0,3],[3,2,3,4],[4,2,4,3],[6,5,6,8],[7,5,9,7],[8,2,8,3],[10,2,10,3],[11,2,11,3],[68,2,76,7]]}
[null,null,"Enter values in yellow cells only",{"$nulls":4},"Duration (months)",{"$f":"IF('Proposal Budget'!D7<>\"\",'Proposal Budget'!D7,\"\")","v":""}]
[]
[]
[]
[null,null,"Equipment Cost (Total cost):"]
[]
[null,null,"Equipment code",null,null,"According to Depreciation Table \"Tabela Vida Útil Equipamento\"",{"$nulls":3},"From: Decreto-Lei n.º 192/2015"]
[null,null,"Período vida útil (anos)",null,{"$f":"VLOOKUP(E7,'Equipment Useful Life Table IST'!$B$4:$D$1291,3,FALSE)","v":{"$error":"#N/A"}},{"$f":"IFERROR(IF(E8=\"–\",\"Equipment with no depreciation, ineligible cost is the equipments total cost\",IF(E8=\"(a)\",\"(See Notes section in tabela vida útil equipamento)\",IF(E8=\"(b)\",\"(See Notes section in tabela vida útil equipamento)\",IF(E8=\"(c)\",\"(See Notes section in tabela vida útil equipamento)\",\"\")))),\"\")","v":""},{"$nulls":3},"(Published in Diário da República n.º 178/2015, Série I de 2015-09-11)"]
[null,null,"Taxa tabela",null,{"$f":"1/E8","v":{"$error":"#N/A"}}]
[]
[null,null,"Coeficiente Depreciação",null,{"$f":"IF(E8=1,1,IF(E8<5,\"1,5\",IF(OR(E8=5,E8=6),\"2\",\"2,5\")))","v":{"$error":"#N/A"}}]
[null,null,"Nova taxa",null,{"$f":"+E9*E11","v":{"$error":"#N/A"}}]
[]
[null,null,"Anos","Quotas decrescentes","Quota A","Depreciação","Valor contabilístico ","Depreciação/Mês","Nº Meses","Valor Anual","Ano a Reportar","Descrição"]
[1,{"$f":"YEAR(E4)","v":1900},{"$f":"IF(D15>0,A15,\"0\")","v":{"$error":"#N/A"}},{"$f":"+E5*$E$12","v":{"$error":"#N/A"}},{"$f":"IFERROR(+E5/E8,0)","v":0},{"$f":"IFERROR(IF(A15=E$8,E15,IF(D$15>E$15,D15,E15)),0)","v":0},{"$f":"+E5-F15","v":0},{"$f":"+F15/12","v":{"v":0,"d":"0.00"}},12,{"$f":"H15*I15","v":{"v":0,"d":"0.00"}},{"$f":"IF(L15>\"0\",B15,\"\")","v":{"$error":"#N/A"}},{"$f":"IF(C15=0,\"\",$C$44&\" \"&$C$47&\" \"&$C$45&\" \"&$C$46&\" \"&C15)","v":{"$error":"#N/A"}},{"$f":"IF(A15*12>=$I$1+1,0,1)","v":{"$error":"#VALUE!"}},{"$f":"IF(I1<=12,H15*I1,IF(I1<=24,12*H15+(I1-12)*H16,IF(I1<=36,12*(H15+H16)+(I1-24)*H17,IF(I1<=48,(H15+H16+H17)*12+(I1-36)*H18,IF(I1<=60,(H15+H16+H17+H18)*12+(I1-48)*H19,IF(I1<=72,(H15+H16+H17+H18+H19)*12+(I1-60)*H20,IF(I1<=84,(H15+H16+H17+H18+H19+H20)*12+(I1-72)*H21,IF(I1<=96,(H15+H16+H17+H18+H19+H20+H21)*12+(I1-84)*H22,IF(I1<=108,(H15+H16+H17+H18+H19+H20+H21+H22)*12+(I1-96)*H23,IF(I1<=120,(H15+H16+H17+H18+H19+H20+H21+H22+H23)*12+(I1-108)*H24,IF(I1<=132,(H15+H16+H17+H18+H19+H20+H21+H22+H23+H24)*12+(I1-120)*H25)))))))))))","v":false},"Eligible Cost"]
[2,{"$f":"B15+1","v":1901},{"$error":"#N/A"},{"$f":"+G15*$E$12","v":{"$error":"#N/A"}},{"$f":"IFERROR(+G15/(E8-1),0)","v":0},{"$f":"IFERROR(IF(A16=E$8,E16,IF(F15=E15,E16,IF(D16>E16,D16,E16))),0)","v":0},{"$f":"+G15-F16","v":0},{"v":0,"d":"0.00"},{"$f":"IF(J16=0,\"0\",IF(AND(J16>0,H16>0),\"12\",12-I$15))","v":"0"},{"$f":"+H16*C$47+H15*C$48","v":{"v":0,"d":"0.00"}},{"$error":"#N/A"},{"$f":"IF(AND(C16=\"0\",I16=\"0\"),\" \",IF(C16=\"0\",C$44&\" \"&C$48&\" \"&C$45&\" \"&C$46&\" \"&C15,IF(I16=\"0\",\"\",$C$44&\" \"&$C$47&\" \"&$C$45&\" \"&$C$46&\" \"&C16&\" \"&C$49&\" \"&C$48&\" \"&C$45&\" \"&C$46&\" \"&C15)))","v":{"$error":"#N/A"}},{"$error":"#VALUE!"}]
[3,{"$f":"B16+1","v":1902},{"$error":"#N/A"},{"$error":"#N/A"},{"$f":"IFERROR(+G16/(E8-2),0)","v":0},0,0,{"v":0,"d":"0.00"},"0",{"v":0,"d":"0.00"},{"$error":"#N/A"},{"$error":"#N/A"},{"$error":"#VALUE!"}]
[4,1903,{"$error":"#N/A"},{"$error":"#N/A"},{"$f":"IFERROR(+G17/(E8-3),0)","v":0},0,0,{"v":0,"d":"0.00"},"0",{"v":0,"d":"0.00"},{"$error":"#N/A"},{"$error":"#N/A"},{"$error":"#VALUE!"}]
[5,1904,{"$error":"#N/A"},{"$error":"#N/A"},{"$f":"IFERROR(+G18/(E8-4),0)","v":0},0,0,{"v":0,"d":"0.00"},"0",{"v":0,"d":"0.00"},{"$error":"#N/A"},{"$error":"#N/A"},{"$error":"#VALUE!"}]
[6,1905,{"$error":"#N/A"},{"$error":"#N/A"},{"$f":"IFERROR(+G19/(E8-5),0)","v":0},0,0,{"v":0,"d":"0.00"},"0",{"v":0,"d":"0.00"},{"$error":"#N/A"},{"$error":"#N/A"},{"$error":"#VALUE!"}]
[7,1906,{"$error":"#N/A"},{"$error":"#N/A"},{"$f":"IFERROR(+G20/(E8-6),0)","v":0},0,0,{"v":0,"d":"0.00"},"0",{"v":0,"d":"0.00"},{"$error":"#N/A"},{"$error":"#N/A"},{"$error":"#VALUE!"}]
[8,1907,{"$error":"#N/A"},{"$error":"#N/A"},{"$f":"IFERROR(+G21/(E8-7),0)","v":0},0,0,{"v":0,"d":"0.00"},"0",{"v":0,"d":"0.00"},{"$error":"#N/A"},{"$error":"#N/A"},{"$error":"#VALUE!"}]
[9,1908,{"$error":"#N/A"},{"$error":"#N/A"},{"$f":"IFERROR(+G22/(E8-8),0)","v":0},0,0,{"v":0,"d":"0.00"},"0",{"v":0,"d":"0.00"},{"$error":"#N/A"},{"$error":"#N/A"},{"$error":"#VALUE!"}]
[10,1909,{"$error":"#N/A"},{"$error":"#N/A"},{"$f":"IFERROR(+G23/(E8-9),0)","v":0},0,0,{"v":0,"d":"0.00"},"0",{"v":0,"d":"0.00"},{"$error":"#N/A"},{"$error":"#N/A"},{"$error":"#VALUE!"}]
[11,1910,{"$error":"#N/A"},{"$error":"#N/A"},{"$f":"IFERROR(+G24/(E8-10),0)","v":0},0,0,{"v":0,"d":"0.00"},"0",{"v":0,"d":"0.00"},{"$error":"#N/A"},{"$error":"#N/A"},{"$error":"#VALUE!"}]
[null,null,{"$f":"IFERROR(IF(J26<>0,\"Ano 12 a \"&E8,0),\"#N/A\")","v":0},"…","…","…","…","…","…",{"$f":"E5-SUM(J15:J25)","v":{"v":0,"d":"0.00"}},{"$nulls":3},{"$f":"J27-N15","v":{"v":0,"d":"0.00 €"}},"Ineligible Cost"]
[{"$nulls":5},{"$f":"SUM(F15:F25)+J26","v":{"v":0,"d":"0.00 €"}},{"$nulls":3},{"$f":"SUM(J15:J26)","v":{"v":0,"d":"0.00 €"}}]
[]
[]
[]
[{"$nulls":3},"Coeficiente de Depreciação:"]
[null,null,"a)"," 1,5 quando o período de vida útil do elemento seja inferior a cinco anos; "]
[null,null,"b)"," 2 quando o período de vida útil do elemento seja de cinco ou seis anos; "]
[null,null,"c)"," 2,5 quando o período de vida útil do elemento seja superior a seis anos. "]
[]
[{"$nulls":3},"Método das Quotas Decrescentes:"]
[null,null,"1-","A quota decrescente é apurada aplicando a nova taxa ao valor líquido do ativo no ano anterior."]
[null,null,"2-","A depreciação do ano é quota decrescente ou quota A, das duas a mais elevada"]
[null,null,"3-","No último ano a depreciação é apurada por diferença de forma a que o valor líquido iguale zero."]
[]
[]
[]
[]
[null,null,"Valor de"]
[null,null,"meses do"]
[null,null,"período de vida útil do ano"]
[null,null,{"$f":"12-(MONTH(E4))+1","v":12}]
[null,null,{"$f":"IFERROR(MOD(E8*12-I15,12),MOD(0*12-I15,12))","v":0}]
[null,null,"+"]
[]
[null,null,1]
[null,null,2]
[null,null,3]
[null,null,4]
[null,null,5]
[null,null,6]
[null,null,7]
[null,null,8]
[null,null,9]
[null,null,10]
{"$rows_empty":8}
[null,null,"Relativamente a um determinado equipamento, as entidades podem optar por apresentar uma única linha de despesa correspondente à amortização total imputável ao projeto, em função da utilização prevista desse mesmo equipamento ao longo da execução do projeto."]

{"sheet":"C2. Equip. IST-ID","index":5,"n_rows":69,"n_cols":15,"rows_kept":69,"merged":[[0,2,0,3],[4,2,4,3],[6,5,6,8],[8,2,8,3],[10,2,10,3],[11,2,11,3],[68,2,71,7]]}
[null,null,"Enter values in yellow cells only",{"$nulls":4},"Duration (months)",{"$f":"IF('Proposal Budget'!D7<>\"\",'Proposal Budget'!D7,\"\")","v":""}]
[]
[]
[]
[null,null,"Equipment Cost (Total cost):"]
[]
[null,null,"Equipment code",null,null,"According to Depreciation Table \"Tabela Vida Útil Equipamento\""]
[null,null,"Período vida útil (anos)",null,{"$f":"VLOOKUP('C2. Equip. IST-ID'!E7,'Equip. Useful Life Table IST-ID'!$B$5:$G$162,5,FALSE)","v":{"$error":"#N/A"}}]
[null,null,"Taxa tabela",null,{"$f":"1/E8","v":{"$error":"#N/A"}}]
[]
[null,null,"Coeficiente Depreciação",null,{"$f":"IF(E8=1,1,IF(E8<5,\"1,5\",IF(OR(E8=5,E8=6),\"2\",\"2,5\")))","v":{"$error":"#N/A"}}]
[null,null,"Nova taxa",null,{"$f":"+E9*E11","v":{"$error":"#N/A"}}]
[]
[null,null,"Anos","Quotas decrescentes","Quota A","Depreciação","Valor contabilístico ","Depreciação/Mês","Nº Meses","Valor Anual","Ano a Reportar","Descrição"]
[1,{"$f":"YEAR(E4)","v":1900},{"$f":"IF(D15>0,A15,\"0\")","v":{"$error":"#N/A"}},{"$f":"+E5*$E$12","v":{"$error":"#N/A"}},{"$f":"IFERROR(+E5/E8,0)","v":0},{"$f":"IFERROR(IF(A15=E$8,E15,IF(D$15>E$15,D15,E15)),0)","v":0},{"$f":"+E5-F15","v":0},{"$f":"+F15/12","v":{"v":0,"d":"0.00"}},12,{"$f":"H15*I15","v":{"v":0,"d":"0.00"}},{"$f":"IF(L15>\"0\",B15,\"\")","v":{"$error":"#N/A"}},{"$f":"IF(C15=0,\"\",$C$44&\" \"&$C$47&\" \"&$C$45&\" \"&$C$46&\" \"&C15)","v":{"$error":"#N/A"}},{"$f":"IF(A15*12>=$I$1+1,0,1)","v":{"$error":"#VALUE!"}},{"$f":"IF(I1<=12,H15*I1,IF(I1<=24,12*H15+(I1-12)*H16,IF(I1<=36,12*(H15+H16)+(I1-24)*H17,IF(I1<=48,(H15+H16+H17)*12+(I1-36)*H18,IF(I1<=60,(H15+H16+H17+H18)*12+(I1-48)*H19,IF(I1<=72,(H15+H16+H17+H18+H19)*12+(I1-60)*H20,IF(I1<=84,(H15+H16+H17+H18+H19+H20)*12+(I1-72)*H21,IF(I1<=96,(H15+H16+H17+H18+H19+H20+H21)*12+(I1-84)*H22,IF(I1<=108,(H15+H16+H17+H18+H19+H20+H21+H22)*12+(I1-96)*H23,IF(I1<=120,(H15+H16+H17+H18+H19+H20+H21+H22+H23)*12+(I1-108)*H24,IF(I1<=132,(H15+H16+H17+H18+H19+H20+H21+H22+H23+H24)*12+(I1-120)*H25)))))))))))","v":false},"Eligible Cost"]
[2,{"$f":"B15+1","v":1901},{"$error":"#N/A"},{"$f":"+G15*$E$12","v":{"$error":"#N/A"}},{"$f":"IFERROR(+G15/(E8-1),0)","v":0},{"$f":"IFERROR(IF(A16=E$8,E16,IF(F15=E15,E16,IF(D16>E16,D16,E16))),0)","v":0},{"$f":"+G15-F16","v":0},{"v":0,"d":"0.00"},{"$f":"IF(J16=0,\"0\",IF(AND(J16>0,H16>0),\"12\",12-I$15))","v":{"$error":"#N/A"}},{"$f":"+H16*C$47+H15*C$48","v":{"$error":"#N/A"}},{"$error":"#N/A"},{"$f":"IF(AND(C16=\"0\",I16=\"0\"),\" \",IF(C16=\"0\",C$44&\" \"&C$48&\" \"&C$45&\" \"&C$46&\" \"&C15,IF(I16=\"0\",\"\",$C$44&\" \"&$C$47&\" \"&$C$45&\" \"&$C$46&\" \"&C16&\" \"&C$49&\" \"&C$48&\" \"&C$45&\" \"&C$46&\" \"&C15)))","v":{"$error":"#N/A"}},{"$error":"#VALUE!"}]
[3,{"$f":"B16+1","v":1902},{"$error":"#N/A"},{"$error":"#N/A"},{"$f":"IFERROR(+G16/(E8-2),0)","v":0},0,0,{"v":0,"d":"0.00"},{"$error":"#N/A"},{"$error":"#N/A"},{"$error":"#N/A"},{"$error":"#N/A"},{"$error":"#VALUE!"}]
[4,1903,{"$error":"#N/A"},{"$error":"#N/A"},{"$f":"IFERROR(+G17/(E8-3),0)","v":0},0,0,{"v":0,"d":"0.00"},{"$error":"#N/A"},{"$error":"#N/A"},{"$error":"#N/A"},{"$error":"#N/A"},{"$error":"#VALUE!"}]
[5,1904,{"$error":"#N/A"},{"$error":"#N/A"},{"$f":"IFERROR(+G18/(E8-4),0)","v":0},0,0,{"v":0,"d":"0.00"},{"$error":"#N/A"},{"$error":"#N/A"},{"$error":"#N/A"},{"$error":"#N/A"},{"$error":"#VALUE!"}]
[6,1905,{"$error":"#N/A"},{"$error":"#N/A"},{"$f":"IFERROR(+G19/(E8-5),0)","v":0},0,0,{"v":0,"d":"0.00"},{"$error":"#N/A"},{"$error":"#N/A"},{"$error":"#N/A"},{"$error":"#N/A"},{"$error":"#VALUE!"}]
[7,1906,{"$error":"#N/A"},{"$error":"#N/A"},{"$f":"IFERROR(+G20/(E8-6),0)","v":0},0,0,{"v":0,"d":"0.00"},{"$error":"#N/A"},{"$error":"#N/A"},{"$error":"#N/A"},{"$error":"#N/A"},{"$error":"#VALUE!"}]
[8,1907,{"$error":"#N/A"},{"$error":"#N/A"},{"$f":"IFERROR(+G21/(E8-7),0)","v":0},0,0,{"v":0,"d":"0.00"},{"$error":"#N/A"},{"$error":"#N/A"},{"$error":"#N/A"},{"$error":"#N/A"},{"$error":"#VALUE!"}]
[9,1908,{"$error":"#N/A"},{"$error":"#N/A"},{"$f":"IFERROR(+G22/(E8-8),0)","v":0},0,0,{"v":0,"d":"0.00"},{"$error":"#N/A"},{"$error":"#N/A"},{"$error":"#N/A"},{"$error":"#N/A"},{"$error":"#VALUE!"}]
[10,1909,{"$error":"#N/A"},{"$error":"#N/A"},{"$f":"IFERROR(+G23/(E8-9),0)","v":0},0,0,{"v":0,"d":"0.00"},{"$error":"#N/A"},{"$error":"#N/A"},{"$error":"#N/A"},{"$error":"#N/A"},{"$error":"#VALUE!"}]
[11,1910,{"$error":"#N/A"},{"$error":"#N/A"},{"$f":"IFERROR(+G24/(E8-10),0)","v":0},0,0,{"v":0,"d":"0.00"},{"$error":"#N/A"},{"$error":"#N/A"},{"$error":"#N/A"},{"$error":"#N/A"},{"$error":"#VALUE!"}]
[null,null,{"$f":"IFERROR(IF(J26<>0,\"Ano 12 a \"&E8,0),\"#N/A\")","v":"#N/A"},"…","…","…","…","…","…",{"$f":"E5-SUM(J15:J25)","v":{"$error":"#N/A"}},{"$nulls":3},{"$f":"J27-N15","v":{"$error":"#N/A"}},"Ineligible Cost"]
[{"$nulls":5},{"$f":"SUM(F15:F25)+J26","v":{"$error":"#N/A"}},{"$nulls":3},{"$f":"SUM(J15:J26)","v":{"$error":"#N/A"}}]
[]
[]
[]
[{"$nulls":3},"Coeficiente de Depreciação:"]
[null,null,"a)"," 1,5 quando o período de vida útil do elemento seja inferior a cinco anos; "]
[null,null,"b)"," 2 quando o período de vida útil do elemento seja de cinco ou seis anos; "]
[null,null,"c)"," 2,5 quando o período de vida útil do elemento seja superior a seis anos. "]
[]
[{"$nulls":3},"Método das Quotas Decrescentes:"]
[null,null,"1-","A quota decrescente é apurada aplicando a nova taxa ao valor líquido do ativo no ano anterior."]
[null,null,"2-","A depreciação do ano é quota decrescente ou quota A, das duas a mais elevada"]
[null,null,"3-","No último ano a depreciação é apurada por diferença de forma a que o valor líquido iguale zero."]
[]
[]
[]
[]
[null,null,"Valor de"]
[null,null,"meses do"]
[null,null,"período de vida útil do ano"]
[null,null,{"$f":"12-(MONTH(E4))+1","v":12}]
[null,null,{"$f":"MOD(E8*12-I15,12)","v":{"$error":"#N/A"}}]
[null,null,"+"]
[]
[null,null,1]
[null,null,2]
[null,null,3]
[null,null,4]
[null,null,5]
[null,null,6]
[null,null,7]
[null,null,8]
[null,null,9]
[null,null,10]
{"$rows_empty":8}
[null,null,"Relativamente a um determinado equipamento, as entidades podem optar por apresentar uma única linha de despesa correspondente à amortização total imputável ao projeto, em função da utilização prevista desse mesmo equipamento ao longo da execução do projeto."]

{"sheet":"Teachers & Researchers","index":6,"n_rows":30,"n_cols":15,"rows_kept":30,"merged":[[1,0,2,0],[1,1,1,12],[2,1,2,3],[2,4,2,6],[2,7,2,9],[2,10,2,12],[4,0,5,0],[6,0,7,0],[8,0,9,0],[10,0,11,0],[12,0,13,0],[14,0,15,0],[16,0,17,0],[18,0,19,0],[20,0,21,0],[22,0,23,0],[24,0,25,0],[26,0,27,0],[28,0,29,0]]}
[2025,{"$nulls":13},"1 PM = (Vencimento anual + Encargos sociais da entidade patronal) / 11"]
["CATEGORIA","ESCALÃO",{"$nulls":12},"1 PM = 144,45 horas"]
[null,1,null,null,2,null,null,3,null,null,4,{"$nulls":3},"Horas produtivas anuais = 1589"]
[null,"VB","Hourly rate","Custo PM","VB","Hourly rate","Custo PM","VB","Hourly rate","Custo PM","VB","Hourly rate","Custo PM"]
["Professor Catedrático",285,null,null,300,null,null,310,null,null,330]
[null,{"v":5117.26,"d":"€5,117.26"},{"$f":"+B6*1.2375*14/1610","v":{"v":55.06616739130435,"d":"€55.07"}},{"$f":"+C6*146.36","v":{"v":8059.484259391305,"d":"€8,059.48"}},{"v":5386.59,"d":"€5,386.59"},{"$f":"+E6*1.2375*14/1610","v":{"v":57.96439239130435,"d":"€57.96"}},{"$f":"+F6*146.36","v":{"v":8483.668470391305,"d":"€8,483.67"}},{"v":5566.13,"d":"€5,566.13"},{"$f":"+H6*1.2375*14/1610","v":{"v":59.89639891304348,"d":"€59.90"}},{"$f":"+I6*146.36","v":{"v":8766.436944913044,"d":"€8,766.44"}},{"v":5925.25,"d":"€5,925.25"},{"$f":"+K6*1.2375*14/1610","v":{"v":63.76084239130435,"d":"€63.76"}},{"$f":"+L6*146.36","v":{"v":9332.036892391307,"d":"€9,332.04"}}]
["Professor Associado com Agregação",245,null,null,255,null,null,265,null,null,285]
[null,{"v":4399.05,"d":"€4,399.05"},{"$f":"+B8*1.2375*14/1610","v":{"v":47.33760326086957,"d":"€47.34"}},{"$f":"+C8*146.36","v":{"v":6928.331613260871,"d":"€6,928.33"}},{"v":4578.61,"d":"€4,578.61"},{"$f":"+E8*1.2375*14/1610","v":{"v":49.269825000000004,"d":"€49.27"}},{"$f":"+F8*146.36","v":{"v":7211.131587000002,"d":"€7,211.13"}},{"v":4758.17,"d":"€4,758.17"},{"$f":"+H8*1.2375*14/1610","v":{"v":51.20204673913043,"d":"€51.20"}},{"$f":"+I8*146.36","v":{"v":7493.931560739131,"d":"€7,493.93"}},{"v":5117.26,"d":"€5,117.26"},{"$f":"+K8*1.2375*14/1610","v":{"v":55.06616739130435,"d":"€55.07"}},{"$f":"+L8*146.36","v":{"v":8059.484259391305,"d":"€8,059.48"}}]
["Professor Associado",220,null,null,230,null,null,250,null,null,260]
[null,{"v":3950.17,"d":"€3,950.17"},{"$f":"+B10*1.2375*14/1610","v":{"v":42.507264130434784,"d":"€42.51"}},{"$f":"+C10*146.36","v":{"v":6221.363178130436,"d":"€6,221.36"}},{"v":4129.71,"d":"€4,129.71"},{"$f":"+E10*1.2375*14/1610","v":{"v":44.43927065217391,"d":"€44.44"}},{"$f":"+F10*146.36","v":{"v":6504.131652652174,"d":"€6,504.13"}},{"v":4488.84,"d":"€4,488.84"},{"$f":"+H10*1.2375*14/1610","v":{"v":48.30382173913044,"d":"€48.30"}},{"$f":"+I10*146.36","v":{"v":7069.747349739132,"d":"€7,069.75"}},{"v":4668.39,"d":"€4,668.39"},{"$f":"+K10*1.2375*14/1610","v":{"v":50.235935869565225,"d":"€50.24"}},{"$f":"+L10*146.36","v":{"v":7352.531573869567,"d":"€7,352.53"}}]
["Professor Auxiliar com Agregação",220,null,null,230,null,null,250,null,null,260]
[null,{"v":3950.17,"d":"€3,950.17"},{"$f":"+B12*1.2375*14/1610","v":{"v":42.507264130434784,"d":"€42.51"}},{"$f":"+C12*146.36","v":{"v":6221.363178130436,"d":"€6,221.36"}},{"v":4129.71,"d":"€4,129.71"},{"$f":"+E12*1.2375*14/1610","v":{"v":44.43927065217391,"d":"€44.44"}},{"$f":"+F12*146.36","v":{"v":6504.131652652174,"d":"€6,504.13"}},{"v":4488.84,"d":"€4,488.84"},{"$f":"+H12*1.2375*14/1610","v":{"v":48.30382173913044,"d":"€48.30"}},{"$f":"+I12*146.36","v":{"v":7069.747349739132,"d":"€7,069.75"}},{"v":4668.39,"d":"€4,668.39"},{"$f":"+K12*1.2375*14/1610","v":{"v":50.235935869565225,"d":"€50.24"}},{"$f":"+L12*146.36","v":{"v":7352.531573869567,"d":"€7,352.53"}}]
["Professor Auxiliar",195,null,null,210,null,null,230,null,null,245]
[null,{"v":3501.28,"d":"€3,501.28"},{"$f":"+B14*1.2375*14/1610","v":{"v":37.676817391304354,"d":"€37.68"}},{"$f":"+C14*146.36","v":{"v":5514.378993391306,"d":"€5,514.38"}},{"v":3770.6,"d":"€3,770.60"},{"$f":"+E14*1.2375*14/1610","v":{"v":40.5749347826087,"d":"€40.57"}},{"$f":"+F14*146.36","v":{"v":5938.54745478261,"d":"€5,938.55"}},{"v":4129.71,"d":"€4,129.71"},{"$f":"+H14*1.2375*14/1610","v":{"v":44.43927065217391,"d":"€44.44"}},{"$f":"+I14*146.36","v":{"v":6504.131652652174,"d":"€6,504.13"}},{"v":4399.05,"d":"€4,399.05"},{"$f":"+K14*1.2375*14/1610","v":{"v":47.33760326086957,"d":"€47.34"}},{"$f":"+L14*146.36","v":{"v":6928.331613260871,"d":"€6,928.33"}}]
["Assistente",140,null,null,145,null,null,155]
[null,{"v":2523.37,"d":"€2,523.37"},{"$f":"+B16*1.2375*14/1610","v":{"v":27.153655434782607,"d":"€27.15"}},{"$f":"+C16*146.36","v":{"v":3974.2090094347827,"d":"€3,974.21"}},{"v":2609.53,"d":"€2,609.53"},{"$f":"+E16*1.2375*14/1610","v":{"v":28.08081195652174,"d":"€28.08"}},{"$f":"+F16*146.36","v":{"v":4109.907637956522,"d":"€4,109.91"}},{"v":2783.88,"d":"€2,783.88"},{"$f":"+H16*1.2375*14/1610","v":{"v":29.95696956521739,"d":"€29.96"}},{"$f":"+I16*146.36","v":{"v":4384.502065565217,"d":"€4,384.50"}}]
["Assistente Estagiário",100,null,null,110]
[null,{"v":1834.93,"d":"€1,834.93"},{"$f":"+B18*1.2375*14/1610","v":{"v":19.745442391304348,"d":"€19.75"}},{"$f":"+C18*146.36","v":{"v":2889.9429483913045,"d":"€2,889.94"}},{"v":2006.38,"d":"€2,006.38"},{"$f":"+E18*1.2375*14/1610","v":{"v":21.590393478260868,"d":"€21.59"}},{"$f":"+F18*146.36","v":{"v":3159.969989478261,"d":"€3,159.97"}}]
["Investigador coordenador",285,null,null,300,null,null,310,null,null,330]
[null,{"v":5117.26,"d":"€5,117.26"},{"$f":"+B20*1.2375*14/1610","v":{"v":55.06616739130435,"d":"€55.07"}},{"$f":"+C20*146.36","v":{"v":8059.484259391305,"d":"€8,059.48"}},{"v":5386.59,"d":"€5,386.59"},{"$f":"+E20*1.2375*14/1610","v":{"v":57.96439239130435,"d":"€57.96"}},{"$f":"+F20*146.36","v":{"v":8483.668470391305,"d":"€8,483.67"}},{"v":5566.13,"d":"€5,566.13"},{"$f":"+H20*1.2375*14/1610","v":{"v":59.89639891304348,"d":"€59.90"}},{"$f":"+I20*146.36","v":{"v":8766.436944913044,"d":"€8,766.44"}},{"v":5925.25,"d":"€5,925.25"},{"$f":"+K20*1.2375*14/1610","v":{"v":63.76084239130435,"d":"€63.76"}},{"$f":"+L20*146.36","v":{"v":9332.036892391307,"d":"€9,332.04"}}]
["Investigador principal com habilitação ou agregação",245,null,null,255,null,null,265,null,null,285]
[null,{"v":4399.05,"d":"€4,399.05"},{"$f":"+B22*1.2375*14/1610","v":{"v":47.33760326086957,"d":"€47.34"}},{"$f":"+C22*146.36","v":{"v":6928.331613260871,"d":"€6,928.33"}},{"v":4578.61,"d":"€4,578.61"},{"$f":"+E22*1.2375*14/1610","v":{"v":49.269825000000004,"d":"€49.27"}},{"$f":"+F22*146.36","v":{"v":7211.131587000002,"d":"€7,211.13"}},{"v":4758.17,"d":"€4,758.17"},{"$f":"+H22*1.2375*14/1610","v":{"v":51.20204673913043,"d":"€51.20"}},{"$f":"+I22*146.36","v":{"v":7493.931560739131,"d":"€7,493.93"}},{"v":5117.26,"d":"€5,117.26"},{"$f":"+K22*1.2375*14/1610","v":{"v":55.06616739130435,"d":"€55.07"}},{"$f":"+L22*146.36","v":{"v":8059.484259391305,"d":"€8,059.48"}}]
["Investigador principal / Investigador auxiliar com habilitação ou agregação",220,null,null,230,null,null,250,null,null,260]
[null,{"v":3950.17,"d":"€3,950.17"},{"$f":"+B24*1.2375*14/1610","v":{"v":42.507264130434784,"d":"€42.51"}},{"$f":"+C24*146.36","v":{"v":6221.363178130436,"d":"€6,221.36"}},{"v":4129.71,"d":"€4,129.71"},{"$f":"+E24*1.2375*14/1610","v":{"v":44.43927065217391,"d":"€44.44"}},{"$f":"+F24*146.36","v":{"v":6504.131652652174,"d":"€6,504.13"}},{"v":4488.84,"d":"€4,488.84"},{"$f":"+H24*1.2375*14/1610","v":{"v":48.30382173913044,"d":"€48.30"}},{"$f":"+I24*146.36","v":{"v":7069.747349739132,"d":"€7,069.75"}},{"v":4668.39,"d":"€4,668.39"},{"$f":"+K24*1.2375*14/1610","v":{"v":50.235935869565225,"d":"€50.24"}},{"$f":"+L24*146.36","v":{"v":7352.531573869567,"d":"€7,352.53"}}]
["Investigador auxiliar",195,null,null,210,null,null,230,null,null,245]
[null,{"v":3501.28,"d":"€3,501.28"},{"$f":"+B26*1.2375*14/1610","v":{"v":37.676817391304354,"d":"€37.68"}},{"$f":"+C26*146.36","v":{"v":5514.378993391306,"d":"€5,514.38"}},{"v":3770.6,"d":"€3,770.60"},{"$f":"+E26*1.2375*14/1610","v":{"v":40.5749347826087,"d":"€40.57"}},{"$f":"+F26*146.36","v":{"v":5938.54745478261,"d":"€5,938.55"}},{"v":4129.71,"d":"€4,129.71"},{"$f":"+H26*1.2375*14/1610","v":{"v":44.43927065217391,"d":"€44.44"}},{"$f":"+I26*146.36","v":{"v":6504.131652652174,"d":"€6,504.13"}},{"v":4399.05,"d":"€4,399.05"},{"$f":"+K26*1.2375*14/1610","v":{"v":47.33760326086957,"d":"€47.34"}},{"$f":"+L26*146.36","v":{"v":6928.331613260871,"d":"€6,928.33"}}]
["Assistente de investigação",140,null,null,145,null,null,155]
[null,{"v":2523.37,"d":"€2,523.37"},{"$f":"+B28*1.2375*14/1610","v":{"v":27.153655434782607,"d":"€27.15"}},{"$f":"+C28*146.36","v":{"v":3974.2090094347827,"d":"€3,974.21"}},{"v":2609.53,"d":"€2,609.53"},{"$f":"+E28*1.2375*14/1610","v":{"v":28.08081195652174,"d":"€28.08"}},{"$f":"+F28*146.36","v":{"v":4109.907637956522,"d":"€4,109.91"}},{"v":2783.88,"d":"€2,783.88"},{"$f":"+H28*1.2375*14/1610","v":{"v":29.95696956521739,"d":"€29.96"}},{"$f":"+I28*146.36","v":{"v":4384.502065565217,"d":"€4,384.50"}}]
["Estagiário de investigação",100,null,null,110]
[null,{"v":1834.93,"d":"€1,834.93"},{"$f":"+B30*1.2375*14/1610","v":{"v":19.745442391304348,"d":"€19.75"}},{"$f":"+C30*146.36","v":{"v":2889.9429483913045,"d":"€2,889.94"}},{"v":2006.38,"d":"€2,006.38"},{"$f":"+E30*1.2375*14/1610","v":{"v":21.590393478260868,"d":"€21.59"}},{"$f":"+F30*146.36","v":{"v":3159.969989478261,"d":"€3,159.97"}}]

{"sheet":"Post docs","index":7,"n_rows":23,"n_cols":11,"rows_kept":23,"merged":[[0,0,0,1],[1,0,1,9],[16,0,16,2],[18,0,19,2]]}
["Campo de seleção/preenchimento",null,2025]
["Cálculo custos com a contratação de Investigadores doutorados (Post Docs)"]
["Preencher Venc. base mens.",{"v":2459.95,"d":"2,459.95 €"}]
["Índice",{"$f":"VLOOKUP(B5,'Ph.D. Salary level'!$H$4:$I$53,2,FALSE)","v":35},"Observações","Valor  12 m","Valor 15m","Valor  18 m","Valor  20 m","Valor 24 m","Valor 30 m","Valor 36 m","Valor 60 m"]
["Vencimento base mensal",{"$f":"B3","v":{"v":2459.95,"d":"2,459.95 €"}},"Nível remuneratório",{"$f":"B5*12","v":{"v":29519.399999999998,"d":"29,519.40 €"}},{"$f":"B5*15","v":{"v":36899.25,"d":"36,899.25 €"}},{"$f":"B5*18","v":{"v":44279.1,"d":"44,279.10 €"}},{"$f":"B5*20","v":{"v":49199,"d":"49,199.00 €"}},{"$f":"B5*24","v":{"v":59038.799999999996,"d":"59,038.80 €"}},{"$f":"B5*30","v":{"v":73798.5,"d":"73,798.50 €"}},{"$f":"B5*36","v":{"v":88558.2,"d":"88,558.20 €"}},{"$f":"B5*60","v":{"v":147597,"d":"147,597.00 €"}}]
["Subsídio de refeição mensal",{"$f":"6*22","v":{"v":132,"d":"132.00 €"}},"22 dias uteis em média, variável mensalmente em função dos dias do mês/faltas/férias",{"$f":"B6*11","v":{"v":1452,"d":"1,452.00 €"}},{"$f":"B6*14","v":{"v":1848,"d":"1,848.00 €"}},{"$f":"B6*16+B6/2","v":{"v":2178,"d":"2,178.00 €"}},{"$f":"B6*18","v":{"v":2376,"d":"2,376.00 €"}},{"$f":"B6*22","v":{"v":2904,"d":"2,904.00 €"}},{"$f":"B6*28","v":{"v":3696,"d":"3,696.00 €"}},{"$f":"B6*33","v":{"v":4356,"d":"4,356.00 €"}},{"$f":"B6*55","v":{"v":7260,"d":"7,260.00 €"}}]
["Subsídio de férias anual",{"$f":"B5","v":{"v":2459.95,"d":"2,459.95 €"}},"2 dias por cada mês de trabalho completo, até ao limite de  22 dias ",{"$f":"B7","v":{"v":2459.95,"d":"2,459.95 €"}},{"$f":"B5*15/12","v":{"v":3074.9375,"d":"3,074.94 €"}},{"$f":"B5*18/12","v":{"v":3689.9249999999997,"d":"3,689.93 €"}},{"$f":"B5*20/12","v":{"v":4099.916666666667,"d":"4,099.92 €"}},{"$f":"B7*2","v":{"v":4919.9,"d":"4,919.90 €"}},{"$f":"(D7*2)+D7/2","v":{"v":6149.875,"d":"6,149.88 €"}},{"$f":"D7*3","v":{"v":7379.849999999999,"d":"7,379.85 €"}},{"$f":"B7*5","v":{"v":12299.75,"d":"12,299.75 €"}}]
["Duodécimo Sub. Natal (mês)",{"$f":"B5/12","v":{"v":204.9958333333333,"d":"205.00 €"}},"1/12 vencimento base",{"$f":"B8*12","v":{"v":2459.95,"d":"2,459.95 €"}},{"$f":"B8*15","v":{"v":3074.9374999999995,"d":"3,074.94 €"}},{"$f":"B8*18","v":{"v":3689.9249999999997,"d":"3,689.93 €"}},{"$f":"B8*20","v":{"v":4099.916666666666,"d":"4,099.92 €"}},{"$f":"B8*24","v":{"v":4919.9,"d":"4,919.90 €"}},{"$f":"B8*30","v":{"v":6149.874999999999,"d":"6,149.88 €"}},{"$f":"B8*36","v":{"v":7379.849999999999,"d":"7,379.85 €"}},{"$f":"B8*60","v":{"v":12299.749999999998,"d":"12,299.75 €"}}]
["Caducidade",{"$f":"(B5/30)*18","v":{"v":1475.9699999999998,"d":"1,475.97 €"}},"18 dias por cada ano de trabalho completo (vencimento*nº dias/30)",{"$f":"B9","v":{"v":1475.9699999999998,"d":"1,475.97 €"}},{"$f":"(B5/30*(18*15/12))","v":{"v":1844.9624999999996,"d":"1,844.96 €"}},{"$f":"B9+B9/2","v":{"v":2213.955,"d":"2,213.96 €"}},{"$f":"(B5/30*(18*20/12))","v":{"v":2459.95,"d":"2,459.95 €"}},{"$f":"B9*2","v":{"v":2951.9399999999996,"d":"2,951.94 €"}},{"$f":"(B9*2)+B9/2","v":{"v":3689.9249999999993,"d":"3,689.93 €"}},{"$f":"B9*3","v":{"v":4427.91,"d":"4,427.91 €"}},{"$f":"B9*5","v":{"v":7379.8499999999985,"d":"7,379.85 €"}}]
["Seguro Acidentes Trabalho (anual)",{"$f":"'Cálculo Seg. acidentes trab'!B30","v":{"v":222.1079139166667,"d":"222.11 €"}},"valor variável consoante o valor do vencimento base",{"$f":"B10","v":{"v":222.1079139166667,"d":"222.11 €"}},{"$f":"B10*(15/12)","v":{"v":277.6348923958334,"d":"277.63 €"}},{"$f":"B10*1.5","v":{"v":333.16187087500003,"d":"333.16 €"}},{"$f":"B10*(20/12)","v":{"v":370.1798565277778,"d":"370.18 €"}},{"$f":"B10*2","v":{"v":444.2158278333334,"d":"444.22 €"}},{"$f":"(B10*2)+B10/2","v":{"v":555.2697847916668,"d":"555.27 €"}},{"$f":"B10*3","v":{"v":666.3237417500001,"d":"666.32 €"}},{"$f":"D10*5","v":{"v":1110.5395695833336,"d":"1,110.54 €"}}]
["Férias não gozadas",{"$f":"B5","v":{"v":2459.95,"d":"2,459.95 €"}},"Variável em função da data de início e fim de contrato, máximo 22 dias ",{"$f":"B11","v":{"v":2459.95,"d":"2,459.95 €"}},{"$f":"B11","v":{"v":2459.95,"d":"2,459.95 €"}},{"$f":"B11","v":{"v":2459.95,"d":"2,459.95 €"}},{"$f":"B11","v":{"v":2459.95,"d":"2,459.95 €"}},{"$f":"B11","v":{"v":2459.95,"d":"2,459.95 €"}},{"$f":"D11","v":{"v":2459.95,"d":"2,459.95 €"}},{"$f":"B11","v":{"v":2459.95,"d":"2,459.95 €"}},{"$f":"B11","v":{"v":2459.95,"d":"2,459.95 €"}}]
["Subsídio Férias Vincendas",{"$f":"B5","v":{"v":2459.95,"d":"2,459.95 €"}},"Variável em função da data de início e fim de contrato, máximo 22 dias ",{"$f":"B12","v":{"v":2459.95,"d":"2,459.95 €"}},{"$f":"B12","v":{"v":2459.95,"d":"2,459.95 €"}},{"$f":"B12","v":{"v":2459.95,"d":"2,459.95 €"}},{"$f":"B12","v":{"v":2459.95,"d":"2,459.95 €"}},{"$f":"B12","v":{"v":2459.95,"d":"2,459.95 €"}},{"$f":"D12","v":{"v":2459.95,"d":"2,459.95 €"}},{"$f":"B12","v":{"v":2459.95,"d":"2,459.95 €"}},{"$f":"B12","v":{"v":2459.95,"d":"2,459.95 €"}}]
["Férias Vincendas",{"$f":"B5","v":{"v":2459.95,"d":"2,459.95 €"}},"Variável em função da data de início e fim de contrato, máximo 22 dias ",{"$f":"B13","v":{"v":2459.95,"d":"2,459.95 €"}},{"$f":"B13","v":{"v":2459.95,"d":"2,459.95 €"}},{"$f":"B13","v":{"v":2459.95,"d":"2,459.95 €"}},{"$f":"B13","v":{"v":2459.95,"d":"2,459.95 €"}},{"$f":"B13","v":{"v":2459.95,"d":"2,459.95 €"}},{"$f":"D13","v":{"v":2459.95,"d":"2,459.95 €"}},{"$f":"B13","v":{"v":2459.95,"d":"2,459.95 €"}},{"$f":"B13","v":{"v":2459.95,"d":"2,459.95 €"}}]
["TSU (23,75%)- mensal",{"v":0.2375,"d":"23.75%"},"Taxa Social Única/Segurança Social",{"$f":"B14*(D8+D7+D5+D11+D12+D13)","v":{"v":9932.048124999996,"d":"9,932.05 €"}},{"$f":"B14*(E8+E7+E5+E11+E12+E13)","v":{"v":11976.881562499997,"d":"11,976.88 €"}},{"$f":"B14*(F8+F7+F5+F11+F12+F13)","v":{"v":14021.714999999997,"d":"14,021.72 €"}},{"$f":"B14*(G8+G7+G5+G11+G12+G13)","v":{"v":15384.937291666663,"d":"15,384.94 €"}},{"$f":"(H5+H7+H8+H11+H12+H13)*B14","v":{"v":18111.381874999995,"d":"18,111.38 €"}},{"$f":"B14*(I5+I7+I8+I11+I12+I13)","v":{"v":22201.048749999998,"d":"22,201.05 €"}},{"$f":"B14*(J8+J7+J5+J11+J12+J13)","v":{"v":26290.715624999997,"d":"26,290.72 €"}},{"$f":"(K5+K7+K8+K11+K12+K13)*B14","v":{"v":42649.38312500001,"d":"42,649.38 €"}}]
["FCT+FGCT (1% do vencimento base)- mês",{"$f":"B5*1%","v":{"v":24.5995,"d":"24.60"}},"FGCT = 0,075% + FCT = 0,925%",{"$f":"B15*12","v":{"v":295.19399999999996,"d":"295.19 €"}},{"$f":"B15*15","v":{"v":368.9925,"d":"368.99 €"}},{"$f":"B15*18","v":{"v":442.791,"d":"442.79 €"}},{"$f":"B15*20","v":{"v":491.99,"d":"491.99 €"}},{"$f":"B15*24","v":{"v":590.3879999999999,"d":"590.39 €"}},{"$f":"B15*30","v":{"v":737.985,"d":"737.99 €"}},{"$f":"B15*36","v":{"v":885.582,"d":"885.58 €"}},{"$f":"B15*60","v":{"v":1475.97,"d":"1,475.97 €"}}]
["Custo Publicação ",{"v":100,"d":"100.00"},"Publicação em jornal nacional",{"$f":"B16","v":{"v":100,"d":"100.00 €"}},{"$f":"B16","v":{"v":100,"d":"100.00 €"}},{"$f":"B16","v":{"v":100,"d":"100.00 €"}},{"$f":"B16","v":{"v":100,"d":"100.00 €"}},{"v":100,"d":"100.00 €"},{"$f":"B16","v":{"v":100,"d":"100.00 €"}},{"$f":"B16","v":{"v":100,"d":"100.00 €"}},{"v":100,"d":"100.00 €"}]
["Custo Total",null,null,{"$f":"SUM(D5:D16)","v":{"v":55296.470038916654,"d":"55,296.47 €"}},{"v":66845.44645489582,"d":"66,845.45 €"},{"v":78328.42287087499,"d":"78,328.42 €"},{"v":85961.74048152777,"d":"85,961.74 €"},{"v":101360.37570283332,"d":"101,360.38 €"},{"v":124458.32853479167,"d":"124,458.33 €"},{"v":147424.28136675002,"d":"147,424.28 €"},{"v":239552.09269458338,"d":"239,552.09 €"}]
[]
["Nota: o montante correspondente a cada nível remuneratório, pode ser consultado no separador Nível Remuneratório (a célula referente ao vencimento base mensal deve ser alterada de acordo com o nível remuneratório aplicável)"]
[]
[]
["Custo Pessoa-mês",{"$f":"((B5*1.223)*14/11)+B6+(B10/11)","v":{"v":3981.2156194469694,"d":"3,981.22 €"}}]
[null,{"$f":"B22*11","v":{"v":43793.37181391667,"d":"43,793.37 €"}}]

{"sheet":"Other personnel","index":8,"n_rows":26,"n_cols":11,"rows_kept":26,"merged":[[1,0,1,9],[20,0,20,2],[23,3,24,9],[23,11,24,17]]}
[2025]
["Cálculo custos com a contratação - Carreira de TÉCNICO SUPERIOR"]
[]
["CATEGORIA","POSIÇÃO REMUNERATÓRIA","NÍVEL REMUNERATÓRIO DA TABELA ÚNICA","VALOR"]
["Técnico Superior",{"v":1,"d":"01"},"016",{"v":1442.57,"d":"€ 1,442.57"}]
[]
[]
["Nível Remuneratório",15,"Observações","Valor  12 m","Valor 15m","Valor  18 m","Valor  20 m","Valor  24 m","Valor 30 m","Valor 36 m","Valor 60 m"]
["Vencimento base mensal (VB)",{"$f":"D5","v":{"v":1442.57,"d":"1,442.57 €"}},"Nível remuneratório",{"$f":"B9*12","v":{"v":17310.84,"d":"17,310.84 €"}},{"$f":"B9*15","v":{"v":21638.55,"d":"21,638.55 €"}},{"$f":"B9*18","v":{"v":25966.26,"d":"25,966.26 €"}},{"$f":"B9*20","v":{"v":28851.399999999998,"d":"28,851.40 €"}},{"$f":"B9*24","v":{"v":34621.68,"d":"34,621.68 €"}},{"$f":"B9*30","v":{"v":43277.1,"d":"43,277.10 €"}},{"$f":"B9*36","v":{"v":51932.52,"d":"51,932.52 €"}},{"$f":"B9*60","v":{"v":86554.2,"d":"86,554.20 €"}}]
["Subsídio de refeição mensal",{"$f":"6*22","v":{"v":132,"d":"132.00 €"}},"22 dias uteis em média, variável mensalmente em função dos dias do mês/faltas/férias",{"$f":"B10*11","v":{"v":1452,"d":"1,452.00 €"}},{"$f":"B10*14","v":{"v":1848,"d":"1,848.00 €"}},{"$f":"B10*16+B10/2","v":{"v":2178,"d":"2,178.00 €"}},{"$f":"B10*18","v":{"v":2376,"d":"2,376.00 €"}},{"$f":"B10*22","v":{"v":2904,"d":"2,904.00 €"}},{"$f":"B10*28","v":{"v":3696,"d":"3,696.00 €"}},{"$f":"B10*33","v":{"v":4356,"d":"4,356.00 €"}},{"$f":"B10*55","v":{"v":7260,"d":"7,260.00 €"}}]
["Subsídio de férias anual",{"$f":"B9","v":{"v":1442.57,"d":"1,442.57 €"}},"2 dias por cada mês de trabalho completo, até ao limite de  22 dias ",{"$f":"B11","v":{"v":1442.57,"d":"1,442.57 €"}},{"$f":"B9*15/12","v":{"v":1803.2124999999999,"d":"1,803.21 €"}},{"$f":"B11*18/12","v":{"v":2163.855,"d":"2,163.86 €"}},{"$f":"B11*20/12","v":{"v":2404.2833333333333,"d":"2,404.28 €"}},{"$f":"B11*2","v":{"v":2885.14,"d":"2,885.14 €"}},{"$f":"(D11*2)+D11/2","v":{"v":3606.4249999999997,"d":"3,606.43 €"}},{"$f":"D11*3","v":{"v":4327.71,"d":"4,327.71 €"}},{"$f":"B11*5","v":{"v":7212.849999999999,"d":"7,212.85 €"}}]
["Duodécimo Sub. Natal (mês)",{"$f":"B9/12","v":{"v":120.21416666666666,"d":"120.21 €"}},"1/12 vencimento base",{"$f":"B12*12","v":{"v":1442.57,"d":"1,442.57 €"}},{"$f":"B12*15","v":{"v":1803.2124999999999,"d":"1,803.21 €"}},{"$f":"B12*18","v":{"v":2163.855,"d":"2,163.86 €"}},{"$f":"B12*20","v":{"v":2404.2833333333333,"d":"2,404.28 €"}},{"$f":"B12*24","v":{"v":2885.14,"d":"2,885.14 €"}},{"$f":"B12*30","v":{"v":3606.4249999999997,"d":"3,606.43 €"}},{"$f":"B12*36","v":{"v":4327.71,"d":"4,327.71 €"}},{"$f":"B12*60","v":{"v":7212.849999999999,"d":"7,212.85 €"}}]
["Caducidade Contrato anual",{"$f":"(B9/30)*18","v":{"v":865.5419999999999,"d":"865.54 €"}},"18 dias por cada ano de trabalho completo (vencimento*nº dias/30)",{"$f":"B13","v":{"v":865.5419999999999,"d":"865.54 €"}},{"$f":"B13+B13/4","v":{"v":1081.9274999999998,"d":"1,081.93 €"}},{"$f":"B13+B13/2","v":{"v":1298.3129999999999,"d":"1,298.31 €"}},{"$f":"B13*20/12","v":{"v":1442.5699999999997,"d":"1,442.57 €"}},{"$f":"B13*2","v":{"v":1731.0839999999998,"d":"1,731.08 €"}},{"$f":"(B13*2)+B13/2","v":{"v":2163.8549999999996,"d":"2,163.86 €"}},{"$f":"B13*3","v":{"v":2596.6259999999997,"d":"2,596.63 €"}},{"$f":"B13*5","v":{"v":4327.709999999999,"d":"4,327.71 €"}}]
["Seguro Acidentes Trabalho (anual)",{"v":120,"d":"120.00 €"},"valor variável consoante o valor do vencimento base",{"$f":"B14","v":{"v":120,"d":"120.00 €"}},{"$f":"(D14/2)+D14","v":{"v":180,"d":"180.00 €"}},{"$f":"B14*1.5","v":{"v":180,"d":"180.00 €"}},{"$f":"B14*20/12","v":{"v":200,"d":"200.00 €"}},{"$f":"B14*2","v":{"v":240,"d":"240.00 €"}},{"$f":"(B14*2)+B14/2","v":{"v":300,"d":"300.00 €"}},{"$f":"B14*3","v":{"v":360,"d":"360.00 €"}},{"$f":"B14*5","v":{"v":600,"d":"600.00 €"}}]
["Férias não gozadas",{"$f":"B9","v":{"v":1442.57,"d":"1,442.57 €"}},"Variável em função da data de início e fim de contrato, máximo 22 dias ",{"$f":"B15","v":{"v":1442.57,"d":"1,442.57 €"}},{"$f":"B15","v":{"v":1442.57,"d":"1,442.57 €"}},{"$f":"B15","v":{"v":1442.57,"d":"1,442.57 €"}},{"$f":"B15","v":{"v":1442.57,"d":"1,442.57 €"}},{"$f":"B15","v":{"v":1442.57,"d":"1,442.57 €"}},{"$f":"D15","v":{"v":1442.57,"d":"1,442.57 €"}},{"$f":"B15","v":{"v":1442.57,"d":"1,442.57 €"}},{"$f":"B15","v":{"v":1442.57,"d":"1,442.57 €"}}]
["Sub. Férias Vincendas",{"$f":"B9","v":{"v":1442.57,"d":"1,442.57 €"}},"Variável em função da data de início e fim de contrato, máximo 22 dias ",{"$f":"B16","v":{"v":1442.57,"d":"1,442.57 €"}},{"$f":"B16","v":{"v":1442.57,"d":"1,442.57 €"}},{"$f":"B16","v":{"v":1442.57,"d":"1,442.57 €"}},{"$f":"B16","v":{"v":1442.57,"d":"1,442.57 €"}},{"$f":"B16","v":{"v":1442.57,"d":"1,442.57 €"}},{"$f":"D16","v":{"v":1442.57,"d":"1,442.57 €"}},{"$f":"B16","v":{"v":1442.57,"d":"1,442.57 €"}},{"$f":"B16","v":{"v":1442.57,"d":"1,442.57 €"}}]
["Ferias Vincendas",{"$f":"B9","v":{"v":1442.57,"d":"1,442.57 €"}},"Variável em função da data de início e fim de contrato, máximo 22 dias ",{"$f":"B17","v":{"v":1442.57,"d":"1,442.57 €"}},{"$f":"B17","v":{"v":1442.57,"d":"1,442.57 €"}},{"$f":"B17","v":{"v":1442.57,"d":"1,442.57 €"}},{"$f":"B17","v":{"v":1442.57,"d":"1,442.57 €"}},{"$f":"B17","v":{"v":1442.57,"d":"1,442.57 €"}},{"$f":"D17","v":{"v":1442.57,"d":"1,442.57 €"}},{"$f":"B17","v":{"v":1442.57,"d":"1,442.57 €"}},{"$f":"B17","v":{"v":1442.57,"d":"1,442.57 €"}}]
["TSU (23,75%)- mensal",{"v":0.2375,"d":"23.75%"},"Taxa Social Única/Segurança Social",{"$f":"(D9+D11+D12+D15+D16+D17)*B18","v":{"v":5824.376375,"d":"5,824.38 €"}},{"$f":"(E9+E11+E12+E15+E16+E17)*B18","v":{"v":7023.5126875,"d":"7,023.51 €"}},{"$f":"(F9+F11+F12+F15+F16+F17)*B18","v":{"v":8222.649,"d":"8,222.65 €"}},{"$f":"(G9+G11+G1+G15+G16+G166+G12+G17)*B18","v":{"v":9022.073208333333,"d":"9,022.07 €"}},{"$f":"(H9+H11+H12+H15+H16+H17)*B18","v":{"v":10620.921624999999,"d":"10,620.92 €"}},{"$f":"(I9+I11+I12+I15+I16+I17)*B18","v":{"v":13019.19425,"d":"13,019.19 €"}},{"$f":"(J9+J11+J12+J15+J16+J17)*B18","v":{"v":15417.466874999998,"d":"15,417.47 €"}},{"$f":"(K9+K11+K12+K15+K16+K17)*B18","v":{"v":25010.557375000008,"d":"25,010.56 €"}}]
["FCT+FGCT (1% do vencimento base)- mês",{"$f":"B9*1%","v":{"v":14.425699999999999,"d":"14.43"}},"FGCT = 0,075% + FCT = 0,925%",{"$f":"B19*12","v":{"v":173.1084,"d":"173.11 €"}},{"$f":"B19*15","v":{"v":216.38549999999998,"d":"216.39 €"}},{"$f":"B19*18","v":{"v":259.6626,"d":"259.66 €"}},{"$f":"B19*20","v":{"v":288.514,"d":"288.51 €"}},{"$f":"B19*24","v":{"v":346.2168,"d":"346.22 €"}},{"$f":"B19*30","v":{"v":432.77099999999996,"d":"432.77 €"}},{"$f":"B19*36","v":{"v":519.3252,"d":"519.33 €"}},{"$f":"B19*60","v":{"v":865.5419999999999,"d":"865.54 €"}}]
["Custo Publicação",{"v":100,"d":"100.00"},"Publicação em jornal nacional",{"$f":"B20","v":{"v":100,"d":"100.00 €"}},{"$f":"B20","v":{"v":100,"d":"100.00 €"}},{"$f":"B20","v":{"v":100,"d":"100.00 €"}},{"$f":"B20","v":{"v":100,"d":"100.00 €"}},{"v":100,"d":"100.00 €"},{"$f":"B20","v":{"v":100,"d":"100.00 €"}},{"$f":"B20","v":{"v":100,"d":"100.00 €"}},{"v":100,"d":"100.00 €"}]
["Custo Total",null,null,{"$f":"SUM(D9:D20)","v":{"v":33058.71677499999,"d":"33,058.72 €"}},{"v":40022.5106875,"d":"40,022.51 €"},{"v":46860.304599999996,"d":"46,860.30 €"},{"v":51416.833875000004,"d":"51,416.83 €"},{"v":60661.892425000005,"d":"60,661.89 €"},{"v":74529.48025000001,"d":"74,529.48 €"},{"v":88265.06807500002,"d":"88,265.07 €"},{"v":143471.41937500003,"d":"143,471.42 €"}]
[]
[]
[]
["Custo Pessoa-mês",{"$f":"((B9*1.223)*14/11)+B10+(B14/11)","v":{"v":2388.3348672727275,"d":"2,388.33 €"}}]
[null,{"$f":"B25*11","v":{"v":26271.68354,"d":"26,271.68 €"}}]

{"sheet":"Scholarships","index":9,"n_rows":15,"n_cols":24,"rows_kept":15,"merged":[[1,0,1,22],[3,1,3,4],[3,5,3,8],[3,9,3,12],[3,13,3,16],[3,17,3,20],[6,23,7,23],[9,0,10,2],[9,22,10,22],[9,23,10,30]]}
["BOLSAS "]
["A atribuição de bolsas no âmbito dos projetos são objeto de concurso e contratualização por parte das entidades beneficiárias, nos termos do previsto no Estatuto do Bolseiro de Investigação (Lei n.º 40/2004, de 18 de agosto, na sua redação atual) e do Regulamento de Bolsas de Investigação da FCT."]
["Nota: Escolher o número de meses em cada ano de contrato e número total de bolseiros"]
[null,"Previsão custo 2025",{"$nulls":3},"Previsão custo 2026",{"$nulls":3},"Previsão custo 2027",{"$nulls":3},"Previsão custo 2028",{"$nulls":3},"Previsão custo 2029"]
["Tipo de bolsa","Valor mensal [tab regulada FCT*]","SSV + Seguro Ac. Pessoais *","Total","Nº meses","Valor mensal [tab regulada FCT*]","SSV + Seguro Ac. Pessoais *","Total","Nº meses","Valor mensal [tab regulada FCT*]","SSV + Seguro Ac. Pessoais *","Total","Nº meses","Valor mensal [previsão actualização]","SSV + Seguro Ac. Pessoais [Estimativa*]","Total","Nº meses","Valor mensal [previsão actualização]","SSV + Seguro Ac. Pessoais [Estimativa*]","Total","Nº meses","Nº bolseiros","Cálculo(a)","a) calcular o valor total da tipologia pelo nº de meses pretendido"]
["Atividades de I&D a realizar por doutorados (BIPD)",{"v":1851,"d":"1,851.00"},157.26,{"$f":"B6+C6","v":{"v":2008.26,"d":"2,008.26"}},0,{"$f":"+B6*1.03","v":{"v":1906.53,"d":"1,906.53"}},{"v":161.9778,"d":"161.98"},{"$f":"F6+G6","v":{"v":2068.5078,"d":"2,068.51"}},0,{"$f":"+F6*1.03","v":{"v":1963.7259,"d":"1,963.73"}},{"v":166.83713400000002,"d":"166.84"},{"$f":"J6+K6","v":{"v":2130.563034,"d":"2,130.56"}},0,{"$f":"+J6*1.03","v":{"v":2022.637677,"d":"2,022.64"}},{"$f":"+K6*1.03","v":{"v":171.84224802000003,"d":"171.84"}},{"$f":"N6+O6","v":{"v":2194.47992502,"d":"2,194.48"}},0,{"$f":"+N6*1.03","v":{"v":2083.31680731,"d":"2,083.32"}},{"v":176.99751546060003,"d":"177.00"},{"$f":"R6+S6","v":{"v":2260.3143227706,"d":"2,260.31"}},0,null,{"$f":"((D6*E6)+(H6*I6)+(L6*M6)+(P6*Q6)+(T6*U6))*V6","v":{"v":0,"d":"0.00"}},"A duração da BIPD é, em regra, anual, não podendo ser concedida por períodos inferiores a três meses consecutivos, sendo renovável até ao prazo máximo de três anos."]
["Atividades de I&D a realizar por estudantes de doutoramento ou por licenciados e mestres inscritos em cursos não conferentes de grau académico (BI)",{"v":1309.64,"d":"1,309.64"},157.26,{"$f":"SUM(B7:C7)","v":{"v":1466.9,"d":"1,466.90"}},0,{"v":1348.9292,"d":"1,348.93"},{"v":161.9778,"d":"161.98"},{"$f":"SUM(F7:G7)","v":{"v":1510.9070000000002,"d":"1,510.91"}},0,{"v":1389.397076,"d":"1,389.40"},{"v":166.83713400000002,"d":"166.84"},{"$f":"SUM(J7:K7)","v":{"v":1556.23421,"d":"1,556.23"}},0,{"$f":"+J7*1.03","v":{"v":1431.07898828,"d":"1,431.08"}},{"v":171.84224802000003,"d":"171.84"},{"$f":"SUM(N7:O7)","v":{"v":1602.9212363,"d":"1,602.92"}},0,{"v":1474.0113579284,"d":"1,474.01"},{"v":176.99751546060003,"d":"177.00"},{"$f":"SUM(R7:S7)","v":{"v":1651.008873389,"d":"1,651.01"}},0,null,{"$f":"((D7*E7)+(H7*I7)+(L7*M7)+(P7*Q7)+(T7*U7))*V7","v":{"v":0,"d":"0.00"}},"A duração da BI é, em regra, anual, não podendo ser concedida por períodos inferiores a três meses consecutivos. Podem ser renovadas por períodos adicionais, até atingirem: a) Um ano, quando a bolsa tenha sido atribuída a licenciados ou mestres que se encontrem inscritos em ciclos de estudo não conferentes de grau académico; b) Dois anos, quando a bolsa tenha sido atribuída a estudante inscrito em mestrado; c) Quatro anos, quando a bolsa tenha sido atribuída a estudante inscrito em doutoramento"]
["Atividades de I&D a realizar por estudantes de mestrado, mestrado integrado ou por licenciados e mestres inscritos em cursos não conferentes de grau académico (BI)",{"v":1040.98,"d":"1,040.98"},157.26,{"$f":"SUM(B8:C8)","v":{"v":1198.24,"d":"1,198.24"}},0,{"v":1072.2094,"d":"1,072.21"},{"v":161.9778,"d":"161.98"},{"$f":"SUM(F8:G8)","v":{"v":1234.1871999999998,"d":"1,234.19"}},0,{"v":1104.375682,"d":"1,104.38"},{"v":166.83713400000002,"d":"166.84"},{"$f":"SUM(J8:K8)","v":{"v":1271.2128160000002,"d":"1,271.21"}},0,{"v":1137.50695246,"d":"1,137.51"},{"v":171.84224802000003,"d":"171.84"},{"$f":"SUM(N8:O8)","v":{"v":1309.34920048,"d":"1,309.35"}},0,{"v":1171.6321610338002,"d":"1,171.63"},{"v":176.99751546060003,"d":"177.00"},{"$f":"SUM(R8:S8)","v":{"v":1348.6296764944002,"d":"1,348.63"}},0,null,{"$f":"((D8*E8)+(H8*I8)+(L8*M8)+(P8*Q8)+(T8*U8))*V8","v":{"v":0,"d":"0.00"}}]
["Atividades de iniciação a I&D (BII)",651.12,157.26,{"$f":"SUM(B9:C9)","v":808.38},0,{"v":670.6536,"d":"670.65"},{"v":161.9778,"d":"161.98"},{"$f":"SUM(F9:G9)","v":{"v":832.6314,"d":"832.63"}},0,{"v":690.773208,"d":"690.77"},{"v":166.83713400000002,"d":"166.84"},{"$f":"SUM(J9:K9)","v":{"v":857.610342,"d":"857.61"}},0,{"v":711.49640424,"d":"711.50"},{"v":171.84224802000003,"d":"171.84"},{"$f":"SUM(N9:O9)","v":{"v":883.33865226,"d":"883.34"}},0,{"v":732.8412963672,"d":"732.84"},{"v":176.99751546060003,"d":"177.00"},{"$f":"SUM(R9:S9)","v":{"v":909.8388118278001,"d":"909.84"}},0,null,{"$f":"((D9*E9)+(H9*I9)+(L9*M9)+(P9*Q9)+(T9*U9))*V9","v":{"v":0,"d":"0.00"}},"Duração mínima de três meses, podendo ser renovadas até ao prazo máximo de um ano."]
["* Estimativas inflacionadas para assegurar eventuais aumentos da tabela em vigor:",{"$nulls":21},{"$f":"SUM(W6:W9)","v":{"v":0,"d":"0.00"}},"Colocar, de acordo com o tipo de bolsa, o montante correspondente à duração do contrato na rúbrica RH Bolsas (RESUMO ORÇAMENTO)"]
[]
["Disponivel para consulta na seguinte página: https://www.fct.pt/wp-content/uploads/2024/02/Tabela-de-Valores-SMM_atualizacao-2024.pdf",{"$nulls":5},"https://drh.tecnico.ulisboa.pt/files/sites/45/despacho_8532_regulamento_bolsas.pdf"]
[{"$nulls":6},"https://drh.tecnico.ulisboa.pt/files/sites/45/declaracao_retificacao_665.pdf"]
[]
[{"$nulls":6},"Majoração de bolsas: a bolsa de valor inferior não pode, com majoração, ultrapassar o valor de bolsa imediatamente superior."]

{"sheet":"Ph.D. Salary level","index":10,"n_rows":53,"n_cols":12,"rows_kept":53,"merged":[[2,1,2,2],[3,10,3,11]]}
[]
["Tabela remuneratória única"]
["Níveis remuneratórios/Montante pecuniário (euros)","Nível remuneratório (DL 57/2016)",null,"TRU\n2021","TRU\n2023","TRU 2024","TRU 2025","ATUAL","Nível TRU"]
["33 . . . . . . . . . . . . . . . . . . . . . . . . . . . . . . . . . 2 128,34",1,{"v":2128.34,"d":"2,128.34"},{"$f":"C4+(C4*0.003)","v":{"v":2134.7250200000003,"d":"2,134.73"}},{"v":2228.11,"d":"2,228.11"},{"v":2294.95,"d":"2,294.95"},{"v":2351.53,"d":"2,351.53"},{"$f":"+G4","v":{"v":2351.53,"d":"2,351.53"}},33,null,"DL 57/2016, artig nº 15º"]
["34 . . . . . . . . . . . . . . . . . . . . . . . . . . . . . . . . . 2 179,83",1,{"v":2179.83,"d":"2,179.83"},{"$f":"C5+(C5*0.003)","v":{"v":2186.36949,"d":"2,186.37"}},{"v":2280.73,"d":"2,280.73"},{"v":2349.15,"d":"2,349.15"},{"v":2405.73,"d":"2,405.73"},{"$f":"+G5","v":{"v":2405.73,"d":"2,405.73"}},34,null,"Nível 1 ","entre o nível 33 e 53"]
["35 . . . . . . . . . . . . . . . . . . . . . . . . . . . . . . . . . 2 231,32",1,{"v":2231.32,"d":"2,231.32"},{"v":2238.01396,"d":"2,238.01"},{"v":2333.37,"d":"2,333.37"},{"v":2403.37,"d":"2,403.37"},{"v":2459.95,"d":"2,459.95"},{"v":2459.95,"d":"2,459.95"},35,null,"Nível 2","entre o nível 37 e 53"]
["36 . . . . . . . . . . . . . . . . . . . . . . . . . . . . . . . . . 2 282,81",1,{"v":2282.81,"d":"2,282.81"},{"v":2289.65843,"d":"2,289.66"},{"v":2385.99,"d":"2,385.99"},{"v":2457.57,"d":"2,457.57"},{"v":2514.15,"d":"2,514.15"},{"v":2514.15,"d":"2,514.15"},36,null,"Nível 3","entre o nível 54 e 61"]
["37 . . . . . . . . . . . . . . . . . . . . . . . . . . . . . . . . . 2 334,30","1 e 2",{"v":2334.3,"d":"2,334.30"},{"v":2341.3029,"d":"2,341.30"},{"v":2438.65,"d":"2,438.65"},{"v":2511.81,"d":"2,511.81"},{"v":2568.39,"d":"2,568.39"},{"v":2568.39,"d":"2,568.39"},37,null,"Nível 4","entre o nível 62 e 82"]
["38 . . . . . . . . . . . . . . . . . . . . . . . . . . . . . . . . . 2 385,80","1 e 2",{"v":2385.8,"d":"2,385.80"},{"v":2392.9574000000002,"d":"2,392.96"},{"v":2491.27,"d":"2,491.27"},{"v":2655.01,"d":"2,655.01"},{"v":2622.59,"d":"2,622.59"},{"v":2622.59,"d":"2,622.59"},38]
["39 . . . . . . . . . . . . . . . . . . . . . . . . . . . . . . . . . 2 437,29","1 e 2",{"v":2437.29,"d":"2,437.29"},{"v":2444.60187,"d":"2,444.60"},{"v":2543.91,"d":"2,543.91"},{"v":2620.23,"d":"2,620.23"},{"v":2676.81,"d":"2,676.81"},{"v":2676.81,"d":"2,676.81"},39]
["40 . . . . . . . . . . . . . . . . . . . . . . . . . . . . . . . . . 2 488,78","1 e 2",{"v":2488.78,"d":"2,488.78"},{"v":2496.24634,"d":"2,496.25"},{"v":2596.53,"d":"2,596.53"},{"v":2674.43,"d":"2,674.43"},{"v":2731.93,"d":"2,731.93"},{"v":2731.93,"d":"2,731.93"},40]
["41 . . . . . . . . . . . . . . . . . . . . . . . . . . . . . . . . . 2 540,27","1 e 2",{"v":2540.27,"d":"2,540.27"},{"v":2547.89081,"d":"2,547.89"},{"v":2649.17,"d":"2,649.17"},{"v":2728.65,"d":"2,728.65"},{"v":2787.32,"d":"2,787.32"},{"v":2787.32,"d":"2,787.32"},41]
["42 . . . . . . . . . . . . . . . . . . . . . . . . . . . . . . . . . 2 591,76","1 e 2",{"v":2591.76,"d":"2,591.76"},{"v":2599.53528,"d":"2,599.54"},{"v":2702.15,"d":"2,702.15"},{"v":2783.21,"d":"2,783.21"},{"v":2843.05,"d":"2,843.05"},{"v":2843.05,"d":"2,843.05"},42]
["43 . . . . . . . . . . . . . . . . . . . . . . . . . . . . . . . . . 2 643,26","1 e 2",{"v":2643.26,"d":"2,643.26"},{"v":2651.18978,"d":"2,651.19"},{"v":2755.84,"d":"2,755.84"},{"v":2838.52,"d":"2,838.52"},{"v":2899.55,"d":"2,899.55"},{"v":2899.55,"d":"2,899.55"},43]
["44 . . . . . . . . . . . . . . . . . . . . . . . . . . . . . . . . . 2 694,75","1 e 2",{"v":2694.75,"d":"2,694.75"},{"v":2702.83425,"d":"2,702.83"},{"v":2809.52,"d":"2,809.52"},{"v":2893.81,"d":"2,893.81"},{"v":2956.03,"d":"2,956.03"},{"v":2956.03,"d":"2,956.03"},44]
["45 . . . . . . . . . . . . . . . . . . . . . . . . . . . . . . . . . 2 746,24","1 e 2",{"v":2746.24,"d":"2,746.24"},{"v":2754.4787199999996,"d":"2,754.48"},{"v":2863.21,"d":"2,863.21"},{"v":2949.11,"d":"2,949.11"},{"v":3012.52,"d":"3,012.52"},{"v":3012.52,"d":"3,012.52"},45]
["46 . . . . . . . . . . . . . . . . . . . . . . . . . . . . . . . . . 2 797,73","1 e 2",{"v":2797.73,"d":"2,797.73"},{"v":2806.12319,"d":"2,806.12"},{"v":2916.89,"d":"2,916.89"},{"v":3004.4,"d":"3,004.40"},{"v":3068.99,"d":"3,068.99"},{"v":3068.99,"d":"3,068.99"},46]
["47 . . . . . . . . . . . . . . . . . . . . . . . . . . . . . . . . . 2 849,22","1 e 2",{"v":2849.22,"d":"2,849.22"},{"v":2857.76766,"d":"2,857.77"},{"v":2970.57,"d":"2,970.57"},{"v":3059.69,"d":"3,059.69"},{"v":3125.47,"d":"3,125.47"},{"v":3125.47,"d":"3,125.47"},47]
["48 . . . . . . . . . . . . . . . . . . . . . . . . . . . . . . . . . 2 900,72","1 e 2",{"v":2900.72,"d":"2,900.72"},{"v":2909.4221599999996,"d":"2,909.42"},{"v":3024.25,"d":"3,024.25"},{"v":3114.98,"d":"3,114.98"},{"v":3181.95,"d":"3,181.95"},{"v":3181.95,"d":"3,181.95"},48]
["49 . . . . . . . . . . . . . . . . . . . . . . . . . . . . . . . . . 2 952,21","1 e 2",{"v":2952.21,"d":"2,952.21"},{"v":2961.0666300000003,"d":"2,961.07"},{"v":3077.94,"d":"3,077.94"},{"v":3170.28,"d":"3,170.28"},{"v":3238.44,"d":"3,238.44"},{"v":3238.44,"d":"3,238.44"},49]
["50 . . . . . . . . . . . . . . . . . . . . . . . . . . . . . . . . . 3 003,70","1 e 2",{"v":3003.7,"d":"3,003.70"},{"v":3012.7111,"d":"3,012.71"},{"v":3131.63,"d":"3,131.63"},{"v":3225.58,"d":"3,225.58"},{"v":3294.93,"d":"3,294.93"},{"v":3294.93,"d":"3,294.93"},50]
["51 . . . . . . . . . . . . . . . . . . . . . . . . . . . . . . . . . 3 055,19","1 e 2",{"v":3055.19,"d":"3,055.19"},{"v":3064.35557,"d":"3,064.36"},{"v":3185.32,"d":"3,185.32"},{"v":3280.88,"d":"3,280.88"},{"v":3351.42,"d":"3,351.42"},{"v":3351.42,"d":"3,351.42"},51]
["52 . . . . . . . . . . . . . . . . . . . . . . . . . . . . . . . . . 3 106,68","1 e 2",{"v":3106.68,"d":"3,106.68"},{"v":3116.00004,"d":"3,116.00"},{"v":3238.99,"d":"3,238.99"},{"v":3336.16,"d":"3,336.16"},{"v":3407.89,"d":"3,407.89"},{"v":3407.89,"d":"3,407.89"},52]
["53 . . . . . . . . . . . . . . . . . . . . . . . . . . . . . . . . . 3 158,18","1 e 2",{"v":3158.18,"d":"3,158.18"},{"v":3167.65454,"d":"3,167.65"},{"v":3292.68,"d":"3,292.68"},{"v":3391.46,"d":"3,391.46"},{"v":3464.38,"d":"3,464.38"},{"v":3464.38,"d":"3,464.38"},53]
["54 . . . . . . . . . . . . . . . . . . . . . . . . . . . . . . . . . 3 209,67",3,{"v":3209.67,"d":"3,209.67"},{"v":3219.29901,"d":"3,219.30"},{"v":3346.37,"d":"3,346.37"},{"v":3446.76,"d":"3,446.76"},{"v":3520.87,"d":"3,520.87"},{"v":3520.87,"d":"3,520.87"},54]
["55 . . . . . . . . . . . . . . . . . . . . . . . . . . . . . . . . . 3 261,16",3,{"v":3261.16,"d":"3,261.16"},{"v":3270.94348,"d":"3,270.94"},{"v":3400.05,"d":"3,400.05"},{"v":3502.05,"d":"3,502.05"},{"v":3577.34,"d":"3,577.34"},{"v":3577.34,"d":"3,577.34"},55]
["56 . . . . . . . . . . . . . . . . . . . . . . . . . . . . . . . . . 3 312,65",3,{"v":3312.65,"d":"3,312.65"},{"v":3322.58795,"d":"3,322.59"},{"v":3453.74,"d":"3,453.74"},{"v":3557.35,"d":"3,557.35"},{"v":3633.83,"d":"3,633.83"},{"v":3633.83,"d":"3,633.83"},56]
["57 . . . . . . . . . . . . . . . . . . . . . . . . . . . . . . . . . 3 364,14",3,{"v":3364.14,"d":"3,364.14"},{"v":3374.23242,"d":"3,374.23"},{"v":3507.42,"d":"3,507.42"},{"v":3612.64,"d":"3,612.64"},{"v":3690.31,"d":"3,690.31"},{"v":3690.31,"d":"3,690.31"},57]
["58 . . . . . . . . . . . . . . . . . . . . . . . . . . . . . . . . . 3 415,64",3,{"v":3415.64,"d":"3,415.64"},{"v":3425.88692,"d":"3,425.89"},{"v":3561.11,"d":"3,561.11"},{"v":3667.94,"d":"3,667.94"},{"v":3746.8,"d":"3,746.80"},{"v":3746.8,"d":"3,746.80"},58]
["59 . . . . . . . . . . . . . . . . . . . . . . . . . . . . . . . . . 3 467,13",3,{"v":3467.13,"d":"3,467.13"},{"v":3477.53139,"d":"3,477.53"},{"v":3614.8,"d":"3,614.80"},{"v":3723.24,"d":"3,723.24"},{"v":3803.29,"d":"3,803.29"},{"v":3803.29,"d":"3,803.29"},59]
["60 . . . . . . . . . . . . . . . . . . . . . . . . . . . . . . . . . 3 518,62",3,{"v":3518.62,"d":"3,518.62"},{"v":3529.17586,"d":"3,529.18"},{"v":3668.48,"d":"3,668.48"},{"v":3778.53,"d":"3,778.53"},{"v":3859.77,"d":"3,859.77"},{"v":3859.77,"d":"3,859.77"},60]
["61 . . . . . . . . . . . . . . . . . . . . . . . . . . . . . . . . . 3 570,11",3,{"v":3570.11,"d":"3,570.11"},{"v":3580.82033,"d":"3,580.82"},{"v":3722.16,"d":"3,722.16"},{"v":3833.82,"d":"3,833.82"},{"v":3916.25,"d":"3,916.25"},{"v":3916.25,"d":"3,916.25"},61]
["62 . . . . . . . . . . . . . . . . . . . . . . . . . . . . . . . . . 3 621,60",4,{"v":3621.6,"d":"3,621.60"},{"v":3632.4647999999997,"d":"3,632.46"},{"v":3775.83,"d":"3,775.83"},{"v":3889.1,"d":"3,889.10"},{"v":3972.72,"d":"3,972.72"},{"v":3972.72,"d":"3,972.72"},62]
["63 . . . . . . . . . . . . . . . . . . . . . . . . . . . . . . . . . 3 673,10",4,{"v":3673.1,"d":"3,673.10"},{"v":3684.1193,"d":"3,684.12"},{"v":3829.55,"d":"3,829.55"},{"v":3944.44,"d":"3,944.44"},{"v":4029.25,"d":"4,029.25"},{"v":4029.25,"d":"4,029.25"},63]
["64 . . . . . . . . . . . . . . . . . . . . . . . . . . . . . . . . . 3 724,59",4,{"v":3724.59,"d":"3,724.59"},{"v":3735.76377,"d":"3,735.76"},{"v":3883.22,"d":"3,883.22"},{"v":3999.72,"d":"3,999.72"},{"v":4085.71,"d":"4,085.71"},{"v":4085.71,"d":"4,085.71"},64]
["65 . . . . . . . . . . . . . . . . . . . . . . . . . . . . . . . . . 3 776,08",4,{"v":3776.08,"d":"3,776.08"},{"v":3787.4082399999998,"d":"3,787.41"},{"v":3936.91,"d":"3,936.91"},{"v":4055.02,"d":"4,055.02"},{"v":4142.2,"d":"4,142.20"},{"v":4142.2,"d":"4,142.20"},65]
["66 . . . . . . . . . . . . . . . . . . . . . . . . . . . . . . . . . 3 827,57",4,{"v":3827.57,"d":"3,827.57"},{"v":3839.0527100000004,"d":"3,839.05"},{"v":3990.58,"d":"3,990.58"},{"v":4110.3,"d":"4,110.30"},{"v":4198.67,"d":"4,198.67"},{"v":4198.67,"d":"4,198.67"},66]
["67 . . . . . . . . . . . . . . . . . . . . . . . . . . . . . . . . . 3 879,06",4,{"v":3879.06,"d":"3,879.06"},{"v":3890.69718,"d":"3,890.70"},{"v":4044.27,"d":"4,044.27"},{"v":4165.6,"d":"4,165.60"},{"v":4255.16,"d":"4,255.16"},{"v":4255.16,"d":"4,255.16"},67]
["68 . . . . . . . . . . . . . . . . . . . . . . . . . . . . . . . . . 3 930,56",4,{"v":3930.56,"d":"3,930.56"},{"v":3942.3516799999998,"d":"3,942.35"},{"v":4097.96,"d":"4,097.96"},{"v":4220.9,"d":"4,220.90"},{"v":4311.65,"d":"4,311.65"},{"v":4311.65,"d":"4,311.65"},68]
["69 . . . . . . . . . . . . . . . . . . . . . . . . . . . . . . . . . 3 982,05",4,{"v":3982.05,"d":"3,982.05"},{"v":3993.9961500000004,"d":"3,994.00"},{"v":4151.66,"d":"4,151.66"},{"v":4276.21,"d":"4,276.21"},{"v":4368.15,"d":"4,368.15"},{"v":4368.15,"d":"4,368.15"},69]
["70 . . . . . . . . . . . . . . . . . . . . . . . . . . . . . . . . . 4 033,54",4,{"v":4033.54,"d":"4,033.54"},{"v":4045.64062,"d":"4,045.64"},{"v":4205.33,"d":"4,205.33"},{"v":4331.49,"d":"4,331.49"},{"v":4424.62,"d":"4,424.62"},{"v":4424.62,"d":"4,424.62"},70]
["71 . . . . . . . . . . . . . . . . . . . . . . . . . . . . . . . . . 4 085,03",4,{"v":4085.03,"d":"4,085.03"},{"v":4097.28509,"d":"4,097.29"},{"v":4259.02,"d":"4,259.02"},{"v":4386.79,"d":"4,386.79"},{"v":4481.11,"d":"4,481.11"},{"v":4481.11,"d":"4,481.11"},71]
["72 . . . . . . . . . . . . . . . . . . . . . . . . . . . . . . . . . 4 136,52",4,{"v":4136.52,"d":"4,136.52"},{"v":4148.9295600000005,"d":"4,148.93"},{"v":4312.7,"d":"4,312.70"},{"v":4442.08,"d":"4,442.08"},{"v":4537.58,"d":"4,537.58"},{"v":4537.58,"d":"4,537.58"},72]
["73 . . . . . . . . . . . . . . . . . . . . . . . . . . . . . . . . . 4 188,02",4,{"v":4188.02,"d":"4,188.02"},{"v":4200.58406,"d":"4,200.58"},{"v":4366.39,"d":"4,366.39"},{"v":4497.38,"d":"4,497.38"},{"v":4594.07,"d":"4,594.07"},{"v":4594.07,"d":"4,594.07"},73]
["74 . . . . . . . . . . . . . . . . . . . . . . . . . . . . . . . . . 4 239,51",4,{"v":4239.51,"d":"4,239.51"},{"v":4252.22853,"d":"4,252.23"},{"v":4420.07,"d":"4,420.07"},{"v":4552.67,"d":"4,552.67"},{"v":4650.55,"d":"4,650.55"},{"v":4650.55,"d":"4,650.55"},74]
["75 . . . . . . . . . . . . . . . . . . . . . . . . . . . . . . . . . 4 291",4,{"v":4291,"d":"4,291"},{"v":4303.873,"d":"4,303.87"},{"v":4473.74,"d":"4,473.74"},{"v":4607.95,"d":"4,607.95"},{"v":4707.02,"d":"4,707.02"},{"v":4707.02,"d":"4,707.02"},75]
["76 . . . . . . . . . . . . . . . . . . . . . . . . . . . . . . . . . 4 342,49",4,{"v":4342.49,"d":"4,342.49"},{"v":4355.51747,"d":"4,355.52"},{"v":4527.44,"d":"4,527.44"},{"v":4663.26,"d":"4,663.26"},{"v":4763.52,"d":"4,763.52"},{"v":4763.52,"d":"4,763.52"},76]
["77 . . . . . . . . . . . . . . . . . . . . . . . . . . . . . . . . . 4 393,98",4,{"v":4393.98,"d":"4,393.98"},{"v":4407.16194,"d":"4,407.16"},{"v":4581.12,"d":"4,581.12"},{"v":4718.55,"d":"4,718.55"},{"v":4820,"d":"4,820.00"},{"v":4820,"d":"4,820.00"},77]
["78 . . . . . . . . . . . . . . . . . . . . . . . . . . . . . . . . . 4 445,48",4,{"v":4445.48,"d":"4,445.48"},{"v":4458.81644,"d":"4,458.82"},{"v":4634.82,"d":"4,634.82"},{"v":4773.86,"d":"4,773.86"},{"v":4876.5,"d":"4,876.50"},{"v":4876.5,"d":"4,876.50"},78]
["79 . . . . . . . . . . . . . . . . . . . . . . . . . . . . . . . . . 4 496,97",4,{"v":4496.97,"d":"4,496.97"},{"v":4510.460910000001,"d":"4,510.46"},{"v":4688.49,"d":"4,688.49"},{"v":4829.14,"d":"4,829.14"},{"v":4932.97,"d":"4,932.97"},{"v":4932.97,"d":"4,932.97"},79]
["80 . . . . . . . . . . . . . . . . . . . . . . . . . . . . . . . . . 4 548,46",4,{"v":4548.46,"d":"4,548.46"},{"v":4562.10538,"d":"4,562.11"},{"v":4742.18,"d":"4,742.18"},{"v":4884.45,"d":"4,884.45"},{"v":4989.47,"d":"4,989.47"},{"v":4989.47,"d":"4,989.47"},80]
["81 . . . . . . . . . . . . . . . . . . . . . . . . . . . . . . . . . 4 599,95",4,{"v":4599.95,"d":"4,599.95"},{"v":4613.74985,"d":"4,613.75"},{"v":4795.86,"d":"4,795.86"},{"v":4939.74,"d":"4,939.74"},{"v":5045.94,"d":"5,045.94"},{"v":5045.94,"d":"5,045.94"},81]
["82 . . . . . . . . . . . . . . . . . . . . . . . . . . . . . . . . . 4 651,44",4,{"v":4651.44,"d":"4,651.44"},{"v":4665.394319999999,"d":"4,665.39"},{"v":4849.55,"d":"4,849.55"},{"v":4995.04,"d":"4,995.04"},{"v":5102.43,"d":"5,102.43"},{"v":5102.43,"d":"5,102.43"},82]

{"sheet":"Equipment Useful Life Table IST","index":11,"n_rows":1291,"n_cols":4,"rows_kept":1291,"merged":[[0,1,0,3],[1,1,1,3],[41,1,52,1],[41,3,52,3],[53,1,55,1],[53,3,55,3],[56,1,61,1],[56,3,61,3],[63,1,70,1],[63,3,70,3],[87,1,107,1],[87,3,107,3],[108,1,116,1],[108,3,116,3],[117,1,145,1],[117,3,145,3],[146,1,167,1],[146,3,167,3],[168,1,194,1],[168,3,194,3],[195,1,222,1],[195,3,222,3],[223,1,246,1],[223,3,246,3],[248,1,254,1],[248,3,254,3],[255,1,259,1],[255,3,259,3],[262,1,318,1],[262,3,318,3],[319,1,356,1],[319,3,356,3],[357,1,376,1],[357,3,376,3],[377,1,391,1],[377,3,391,3],[392,1,399,1],[392,3,399,3],[400,1,403,1],[400,3,403,3],[404,1,409,1],[404,3,409,3],[410,1,417,1],[410,3,417,3],[420,1,441,1],[420,3,441,3],[442,1,461,1],[442,3,461,3],[462,1,479,1],[462,3,479,3],[480,1,542,1],[480,3,542,3],[543,1,551,1],[543,3,551,3],[555,1,566,1],[555,3,566,3],[567,1,577,1],[567,3,577,3],[578,1,584,1],[578,3,584,3],[585,1,595,1],[585,3,595,3],[596,1,598,1],[596,3,598,3],[601,1,609,1],[601,3,609,3],[610,1,619,1],[610,3,619,3],[620,1,626,1],[620,3,626,3],[627,1,642,1],[627,3,642,3],[643,1,649,1],[643,3,649,3],[651,1,659,1],[651,3,659,3],[660,1,664,1],[660,3,664,3],[666,1,676,1],[666,3,676,3],[677,1,681,1],[677,3,681,3],[682,1,688,1],[682,3,688,3],[690,1,695,1],[690,3,695,3],[696,1,697,1],[696,3,697,3],[698,1,704,1],[698,3,704,3],[705,1,708,1],[705,3,708,3],[710,1,715,1],[710,3,715,3],[716,1,717,1],[716,3,717,3],[718,1,732,1],[718,3,732,3],[734,1,736,1],[734,3,736,3],[737,1,742,1],[737,3,742,3],[743,1,748,1],[743,3,748,3],[750,1,758,1],[750,3,758,3],[759,1,762,1],[759,3,762,3],[763,1,769,1],[763,3,769,3],[770,1,774,1],[770,3,774,3],[775,1,777,1],[775,3,777,3],[778,1,786,1],[778,3,786,3],[787,1,796,1],[787,3,796,3],[797,1,805,1],[797,3,805,3],[806,1,814,1],[806,3,814,3],[815,1,822,1],[815,3,822,3],[823,1,832,1],[823,3,832,3],[834,1,836,1],[834,3,836,3],[837,1,844,1],[837,3,844,3],[847,1,853,1],[847,3,853,3],[854,1,866,1],[854,3,866,3],[867,1,873,1],[867,3,873,3],[874,1,888,1],[874,3,888,3],[889,1,892,1],[889,3,892,3],[893,1,900,1],[893,3,900,3],[901,1,905,1],[901,3,905,3],[906,1,909,1],[906,3,909,3],[910,1,913,1],[910,3,913,3],[914,1,919,1],[914,3,919,3],[920,1,925,1],[920,3,925,3],[927,1,968,1],[927,3,968,3],[970,1,986,1],[970,3,986,3],[987,1,991,1],[987,3,991,3],[1018,1,1025,1],[1018,3,1025,3],[1026,1,1027,1],[1026,3,1027,3],[1034,1,1037,1],[1034,3,1037,3],[1039,1,1040,1],[1039,3,1040,3],[1049,1,1076,1],[1049,3,1076,3],[1077,1,1099,1],[1077,3,1099,3],[1102,1,1113,1],[1102,3,1113,3],[1114,1,1120,1],[1114,3,1120,3],[1121,1,1134,1],[1121,3,1134,3],[1142,1,1147,1],[1142,3,1147,3],[1151,1,1177,1],[1151,3,1177,3],[1178,1,1184,1],[1178,3,1184,3],[1185,1,1205,1],[1185,3,1205,3],[1206,1,1211,1],[1206,3,1211,3],[1212,1,1226,1],[1212,3,1226,3],[1227,1,1241,1],[1227,3,1241,3],[1244,1,1253,1],[1244,3,1253,3],[1254,1,1267,1],[1254,3,1267,3],[1268,1,1272,1],[1268,3,1272,3],[1274,1,1276,1],[1274,3,1276,3],[1278,1,1282,1],[1278,3,1282,3]]}
[null,"7 — Classificador complementar 2 — Cadastro e vidas úteis dos ativos fixos tangíveis, intangíveis e propriedades de investimento"]
[42,"Diário da República, 1.ª série — N.º 178 — 11 de setembro de 2015"]
[420,"Código de Bens","Tipos de bens","Vida útil (Anos)"]
[4201,42,"42 Propriedades de investimento","Escolha sub-categoria"]
[4202,420,"420 Bens de domínio público","Escolha sub-categoria"]
[4209,4201,"Terrenos e recursos naturais*","–"]
[421,4202,"Edifícios e outras construções*","(a)"]
[422,4209,"Outros","(a)"]
[426,421,"Terrenos e recursos naturais*","–"]
[43,422,"Edifícios e outras construções*","(a)"]
[430,426,"Outras propriedades de investimento","(b)"]
[4301,43,"43 Ativos fixos tangíveis","Escolha sub-categoria"]
[43011,430,"430 Bens de domínio público, património histórico, artístico e cultural","Escolha sub-categoria"]
[43012,4301,"4301 Terrenos e recursos naturais","Escolha sub-categoria"]
[43013,43011,"Terrenos incluídos em planos de urbanização com capacidade construtiva","–"]
[43014,43012,"Terrenos não incluídos em plano de urbanização — solo rural","–"]
[43019,43013,"Outros terrenos situados dentro do perímetro urbano","–"]
[4302,43014,"Recursos naturais \n…","–"]
[43021,43019,"Outros terrenos e outros recursos naturais","–"]
[43022,4302,"4302 Edifícios e outras construções","Escolha sub-categoria"]
[43023,43021,"Habitações e edificações para serviços \n…","(a)"]
[43024,43022,"Edificações para fins industriais \n…","(a)"]
[43025,43023,"Edifícios e construções com finalidade sociocultural\n…","(a)"]
[43026,43024,"Parques de estacionamento \n…","(a)"]
[43027,43025,"Piscinas e complexos desportivos \n…","(a)"]
[43028,43026,"Cemitérios \n…","(a)"]
[43029,43027,"Barragens \n…","(a)"]
[4303,43028,"Edifícios e outras construções militares \n…","(a)"]
[43031,43029,"Outros","(b)"]
[43032,4303,"4303 Infraestruturas","Escolha sub-categoria"]
[43033,43031,"Rodoviárias",20]
[43034,43032,"Ferroviárias",20]
[43035,43033,"Portuárias",20]
[43036,43034,"Aeroportuárias",20]
[43037,43035,"Sistemas de esgotos",20]
[43038,43036,"Sistemas de abastecimento de água",20]
[43039,43037,"Redes de comunicações",10]
[4304,43038,"Infraestruturas militares",20]
[43041,43039,"Outras infraestruturas",10]
[43042,4304,"Outro património histórico, artístico e cultural","–"]
[43043,43041,"Espaços arqueológicos","–"]
[43044,43042,"Obras de arte, coleções e antiguidades","–"]
[43045,null,"1 Instrumentos científicos antigos"]
[43049,null,"2 Instrumentos musicais antigos"]
[431,null,"3 Pedras raras e preciosas, coleções"]
[4311,null,"4 Pergaminhos e papiros"]
[4312,null,"5 Pinturas antigas"]
[4313,null,"6 Quadros e gravuras"]
[4314,null,"7 Esculturas"]
[4319,null,"8 Medalhas, coleções"]
[432,null,"9 Selos"]
[4321,null,"10 Objetos de arte (não inclui artigos eclesiásticos de natureza cultural)"]
[4322,null,"11 Automóveis antigos \n…"]
[4323,43043,"43043 Livros, arquivos e outras publicações de bibliotecas","–"]
[4324,null,"Livros"]
[4325,null,"Arquivos \n…"]
[4329,43044,"43044 Mobiliário e tapeçarias","–"]
[433,null,"Ansas"]
[4331,null,"Arcas"]
[4332,null,"Armários"]
[43321,null,"Cadeirões"]
[43322,null,"Tapeçarias \n…"]
[43323,43045,"Joalharia e artigos religiosos","–"]
[43324,43049,"43049 Outros","–"]
[43325,null,"Baixelas"]
[43326,null,"Porcelanas e loiças"]
[43327,null,"Cerâmicas"]
[43328,null,"Artesanato"]
["43328.1",null,"Caixas de música"]
["43328.2",null,"Fonógrafos"]
[43329,null,"Vestiário e outras indumentárias \n…"]
[4333,431,"431 Terrenos e recursos naturais","Escolha sub-categoria"]
[43331,4311,"Terrenos incluídos em planos de urbanização com capacidade construtiva\n…","–"]
[43332,4312,"Terrenos não incluídos em planos de urbanização — solo rural\n…","–"]
[43333,4313,"Outros terrenos situados dentro do perímetro urbano \n…","–"]
[43334,4314,"Recursos naturais \n…","–"]
[43335,4319,"Outros terrenos e outros recursos naturais","–"]
[43336,432,"432 Edifícios e outras construções","Escolha sub-categoria"]
[43337,4321,"Habitações e edificações para serviços \n…","(a)"]
[43338,4322,"Edificações para fins industriais \n…","(a)"]
[43339,4323,"Edifícios e construções com finalidade sociocultural \n…","(a)"]
[4334,4324,"Parques de estacionamento \n…","(a)"]
[43341,4325,"Piscinas e complexos desportivos \n…","(a)"]
[43342,4329,"Outros","(b)"]
[43343,433,"433 Equipamento básico","Escolha sub-categoria"]
[43344,4331,"Equipamento informático e de telecomunicações** \n…",4]
[43345,4332,"4332 Equipamento para investigação e formação, de medida e de utilização técnica especial","Escolha sub-categoria"]
[43346,43321,"Equipamento e material de laboratório",5]
[43349,null,"01 Alambiques laboratoriais"]
[4335,null,"02 Alicates"]
[43351,null,"03 Aparelhos de ensaio"]
[43352,null,"04 Aquecedores de laboratório"]
[43353,null,"05 Armários"]
[43354,null,"06 Bancadas"]
[43355,null,"07 Câmaras misturadoras"]
[43359,null,"08 Câmaras de secagem e vácuo"]
[4336,null,"09 Ebuliómetros"]
[43361,null,"10 Estufas"]
[43362,null,"11 Estantes de laboratório"]
[43363,null,"12 Fornos"]
[43364,null,"13 Frigoríficos"]
[43365,null,"14 Incubadoras"]
[4337,null,"15 Malas para transporte de vacinas"]
["43371.1",null,"16 Máquina de triturar vacinas"]
["43371.2",null,"17 Mesas de laboratório"]
[43372,null,"18 Microscópios e lupas binocelulares e acessórios (câmara de vidro)"]
["43372.1",null,"19 Moinhos"]
["43372.2",null,"20 Vulcanizadores\n…"]
["43372.3",43322,"Equipamento de ensaio de propriedades físicas",5]
[43373,null,"01 Aparelho de ensaio de propriedades físicas",""]
["43373.1",null,"02 Baroscópios",""]
["43373.2",null,"03 Câmaras explosivas",""]
["43373.3",null,"04 Dinamómetros",""]
["43373.4",null,"05 Geradores de sincronismos duplos de cor",""]
[43374,null,"06 Máquinas de ensaio de propriedades físicas",""]
["43374.1",null,"07 Paquímetros",""]
["43374.2",null,"08 Tensímetros\n…",""]
[43375,43323,"Equipamento de medida",5]
[43376,null,"1. De fluxo de líquidos e de gases e de movimento mecânico",""]
["43376.1",null,"01 Aerómetros",""]
["43376.2",null,"02 Anemómetros",""]
["43376.3",null,"03 Aparelhos hidrostáticos",""]
["43376.4",null,"04 Fluxómetros",""]
["43376.5",null,"06 Gasómetros",""]
["43376.6",null,"07 Geradores",""]
["43376.7",null,"08 Instrumentos de medida de rotação",""]
["43376.8",null,"09 Sistema de purificação de gases",""]
["43376.9",null,"10 Transmissor, caudal",""]
["43376.10",null,"11 Velocímetros",""]
["43376.11",null,"12 Viscosímetros\n…",""]
["43376.12",null,"2. De ensaio de propriedades elétricas e eletrónicas",""]
["43376.13",null,"01 Amperímetros",""]
["43376.14",null,"02 Bolómetros",""]
["43376.15",null,"03 Calibradores",""]
["43376.16",null,"04 Estetoscópios",""]
["43376.17",null,"05 Frequencímetros",""]
["43376.18",null,"06 Galvanómetros",""]
[43379,null,"07 Medidor de vácuo",""]
[4338,null,"08 Megaóhmetros",""]
[43381,null,"09 Multímetros",""]
[43382,null,"10 Osciloscópios",""]
[43383,null,"11 Potenciómetros",""]
[43384,null,"12 Recetores -transmissores",""]
[43385,null,"13 Sintetizadores",""]
[43386,null,"14 Voltímetros",""]
[43387,null,"15 Wattómetros\n…",""]
[43388,43324,"Equipamento de análise química",5]
[43389,null,"01 Agitadores",""]
[433810,null,"02 Alcoómetros",""]
[433811,null,"03 Aparelhos para análise química",""]
[4339,null,"04 Baroscópios",""]
[43391,null,"05 Bomba de pressão de vapor",""]
[43392,null,"06 Bomba de vácuo",""]
["43392.1",null,"07 Calorímetros",""]
["43392.2",null,"08 Cloroscópios",""]
[434,null,"09 Cromatógrafos",""]
[4341,null,"10 Densímetros",""]
["4341.1",null,"11 Equipamento detetor de gás",""]
["4341.2",null,"12 Equipamento de ensaio bacteriológico da água",""]
["4341.3",null,"13 Espectrógrafos",""]
["4341.4",null,"14 Evaporador rotativo",""]
["4341.5",null,"15 Fotómetros de campo",""]
["4341.6",null,"16 Fluorómetros",""]
["4341.7",null,"17 Gasómetros",""]
["4341.8",null,"18 Laboratórios químicos montados em camiões",""]
[4342,null,"19 Máquinas de ensaio de propriedades químicas",""]
[43421,null,"20 Termossalinómetros",""]
[43422,null,"21 Vinómetros\n…",""]
[43423,43325,"43325 Instrumentos astronómicos, meteorológicos e geofísicos",5]
[43424,null,"01 Altímetros",""]
[43425,null,"02 Anemómetros",""]
[43426,null,"03 Astrolábios",""]
[43427,null,"04 Barómetros",""]
[43428,null,"05 Câmaras atmosferas especiais",""]
[43429,null,"06 Câmaras de calibragem",""]
[4343,null,"07 Cataventos",""]
[43431,null,"08 Desumidificadores",""]
["43431.1",null,"09 Ecossondas",""]
["43431.2",null,"10 Equipamento para simulação de chuva",""]
["43431.3",null,"11 Higrómetros",""]
["43431.4",null,"12 Higroscópios",""]
[43432,null,"13 Instrumentos geodésicos",""]
[43433,null,"14 Instrumentos oceanográficos",""]
[4344,null,"15 Instrumentos sismográficos",""]
[43441,null,"16 Pluviómetros",""]
["43441.1",null,"17 Radares",""]
["43441.2",null,"18 Radiómetros",""]
["43441.3",null,"19 Radiossondas",""]
["43441.4",null,"20 Radiosteodolitos",""]
[43442,null,"21 Sonares",""]
[43443,null,"22 Termómetros",""]
[43481,null,"23 Termobarómetros",""]
[43442,null,"24 Termo -higrómetros",""]
[4349,null,"25 Unidades reguladoras de fluxo de ar",""]
["4349.1",null,"26 Visores\n…",""]
["4349.2",43326,"43326 Instrumentos óticos e equipamento fotográfico e cinematográfico",5]
["4349.3",null,"01 Ampliadores",""]
["4349.4",null,"02 Aparelhos óticos",""]
[435,null,"03 Binóculos",""]
[4351,null,"04 Câmaras subaquáticas de filmar",""]
[43511,null,"05 Câmaras térmicas",""]
[43512,null,"06 Câmaras escuras",""]
[43513,null,"07 Ecrãs",""]
[4352,null,"08 Equipamento de visão noturna",""]
[43521,null,"09 Espectoptómetros",""]
[43522,null,"10 Espectroscópios",""]
[4353,null,"11 Estojos",""]
[4359,null,"12 Flashes",""]
[436,null,"13 Fotómetros",""]
[4361,null,"14 Laboratórios fotográficos (em atrelado)",""]
[4362,null,"15 Lupas",""]
[4369,null,"16 Máquinas de copiar",""]
[437,null,"17 Máquinas de estampar",""]
[4371,null,"18 Máquinas de filmar",""]
[43711,null,"19 Máquinas fotográficas",""]
[43712,null,"20 Máquinas heliográficas",""]
[43719,null,"21 Microfilmadores",""]
[4372,null,"22 Objetivas, lentes e óculos",""]
[43721,null,"23 Periscópios",""]
[43722,null,"24 Rebobinadores",""]
[43723,null,"25 Refletores",""]
[43724,null,"26 Telescópios",""]
[43725,null,"27 Tripés\n…",""]
[43726,43327,"Equipamento de desenho, topografia e cartografia",6]
[43729,null,"01 Altímetros",""]
[4373,null,"02 Aparelhos para desenho",""]
[43731,null,"03 Bússolas",""]
[43732,null,"04 Cadeias de agrimensor",""]
[43733,null,"05 Câmaras",""]
[43734,null,"06 Cavaletes",""]
[43735,null,"07 Cofres para arquivo de mapas",""]
[43739,null,"08 Compassos",""]
[4374,null,"09 Curvímetros",""]
[4378,null,"10 Eclímetros",""]
[44,null,"11 Equipamento fotogramétrico",""]
[440,null,"12 Escantilhões",""]
[441,null,"13 Esquadros",""]
[442,null,"14 Estiradores",""]
[443,null,"15 Instrumentos autográficos",""]
[444,null,"16 Instrumentos para levantamento topográfico",""]
[449,null,"17 Máquinas de desenhar",""]
[null,null,"18 Níveis",""]
[null,null,"19 Óculos analíticos",""]
[null,null,"20 Pantógrafos",""]
[null,null,"21 Réguas",""]
[null,null,"22 Taquímetros",""]
[null,null,"23 Teodolitos\n…",""]
[null,43328,"43328 Instrumentos para medida do tempo e pesagem","Escolha sub-categoria"]
[null,"43328.1","1. Instrumentos de medida do tempo:",7]
[null,null,"11 Ampulhetas",""]
[null,null,"12 Cronógrafos",""]
[null,null,"13 Cronómetros",""]
[null,null,"14 Estojos",""]
[null,null,"15 Mecanismos de relojoaria",""]
[null,null,"16 Relógios\n…",""]
[null,"43328.2","2. Instrumentos de pesagem:",8]
[null,null,"21 Balanças"]
[null,null,"22 Básculas"]
[null,null,"23 Caixas de peso"]
[null,null,"24 Jogos de pesos e medidas\n…"]
[null,43329,"Outro equipamento para investigação e formação","(b)"]
[null,4333,"4333 Equipamento e material específico dos serviços de saúde","(b)"]
[null,43331,"Equipamentos e aparelhos médico -cirúrgicos",5]
[null,null,"1. Material de reeducação funcional:"]
[null,null,"11 De eletrónica médica"]
[null,null,"12 De vigilância e diagnóstico"]
[null,null,"13 Desfibrilhadores"]
[null,null,"14 Eletrocardioscópios"]
[null,null,"15 Eletroencefalógrafos"]
[null,null,"16 Eletrocardiógrafos"]
[null,null,"17 Eletromiógrafos"]
[null,null,"18 Estimuladores cardíacos\n…"]
[null,null,"2. Eletroterapia e termoterapia:"]
[null,null,"21 Equipamento de eletrocoagulação"]
[null,null,"22 Equipamento de fitoterapias\n…"]
[null,null,"3. Anestesia e reanimação — oxigenoterapia:"]
[null,null,"31 Aparelhos de anestesia 15 Bombas de perfusão e nutrição"]
[null,null,"32 Humidificadores"]
[null,null,"33 Incubadoras"]
[null,null,"34 Material de aspiração"]
[null,null,"35 Mesas de reanimação"]
[null,null,"36 Respiradores"]
[null,null,"37 Tendas de oxigénio"]
[null,null,"38 Ventiladores\n…"]
[null,null,"4. Hemodiálise:"]
[null,null,"41 Bomba para circulação extracorporal"]
[null,null,"42 Dialisadores\n…"]
[null,null,"5. Equipamento específico do bloco operatório:"]
[null,null,"51 Acessórios de mesas operatórias"]
[null,null,"52 Aparelhos de eletrocirurgia"]
[null,null,"53 Instalações de sistemas de iluminação"]
[null,null,"54 Laser cirúrgico"]
[null,null,"55 Mesas de parto"]
[null,null,"56 Mesas operatórias"]
[null,null,"57 Microscópio operatório\n…"]
[null,null,"6. ORL, oftalmologia, audiologia:"]
[null,null,"61 Cadeira ORL"]
[null,null,"62 Crioterapia"]
[null,null,"63 Fotómetros"]
[null,null,"64 Impedanciómetros"]
[null,null,"65 Lâmpada de fenda"]
[null,null,"66 Laringoscópios"]
[null,null,"67 Laser"]
[null,null,"68 Sonografia e Tonómtero\n…"]
[null,null,"7. Estomatologia e outras especialidades:"]
[null,null,"71 Aparelhos de raios X"]
[null,null,"72 Aspiradores bocais"]
[null,null,"73 Buriladores"]
[null,null,"74 Cadeira estomatológica"]
[null,null,"75 Máquinas para moldar dentaduras"]
[null,null,"76 Máquinas para revelar películas de raios X\n…"]
[null,null,"8. Exploração funcional e endoscopia:"]
[null,null,"81 Espinógrafos"]
[null,null,"82 Fibroscópio gerador de luz fria"]
[null,null,"83 Pletismógrafos\n…"]
[null,null,"9. Outros"]
[null,null,"91 Instrumentação médico -cirúrgica"]
[null,null,"92 Pequeno material de cuidados"]
[null,null,"93 Tensiómetros\n…"]
[null,43332,"Equipamento de imagiologia",5]
[null,null,"1. Equipamento de base — Radiodiagnóstico:"]
[null,null,"11 Aparelhagem de radiologia"]
[null,null,"12 Aparelhagem de radioscopia"]
[null,null,"13 Geradores"]
[null,null,"14 Negatoscopias"]
[null,null,"15 Tomógrafos\n…"]
[null,null,"2. Equipamento de base — Radioterapia:"]
[null,null,"21 Aceleradores de partículas"]
[null,null,"22 Cobalterapias"]
[null,null,"23 Estimuladores"]
[null,null,"3. Equipamento de base — Ultrassons:"]
[null,null,"31 Ecoencefalografias"]
[null,null,"32 Ecoftalmoscopias"]
[null,null,"33 Ecografias"]
[null,null,"34 Estetoscópios e Tensiómetros de ultrassons\n…"]
[null,null,"4. Equipamento de base — Termografia:"]
[null,null,"41 Teletermógrafos"]
[null,null,"42 Termografia por placas\n…"]
[null,null,"5. Equipamento de base — Tomodensitómetro:"]
[null,null,"51 Scanógrafos"]
[null,null,"52 TAC"]
[null,null,"53 Tomodensitómetros de emissão\n…"]
[null,null,"6. Material especializado de tratamento e visualização de"]
[null,null,"imagens:"]
[null,null,"61 Amplificadores de imagem"]
[null,null,"62 Câmaras de radiocinema"]
[null,null,"63 Câmaras de radiografia"]
[null,null,"64 Câmaras de TV"]
[null,null,"65 Recetores de TV\n…"]
[null,null,"7. Radioisótopos:"]
[null,null,"71 Cintigrafos"]
[null,null,"72 Contador de gama\n…"]
[null,null,"8. Equipamento de base — Laboratório de revelação:"]
[null,null,"81 Detetor de radioatividade"]
[null,null,"82 Gamonacâmara"]
[null,null,"83 Máquinas de revelação"]
[null,null,"84 Marcadores de filmes\n…"]
[null,43333,"Equipamento de laboratório",5]
[null,null,"1. Equipamento não específico de laboratório:"]
[null,null,"11 Agitadores"]
[null,null,"12 Biofilizadores"]
[null,null,"13 Centrifugadores"]
[null,null,"14 De tratamento de água"]
[null,null,"15 Estufas"]
[null,null,"16 Máquinas de lavar vidraria"]
[null,null,"17 Microscópios eletrónicos"]
[null,null,"18 Mobiliário de laboratório\n…"]
[null,null,"2. Equipamento específico de hematologia bioquímica, bacteriologia, virologia, parasitologia, anatomia patológica e análise pelos isótopos:"]
[null,null,"21 Analisadores por absorção atómica"]
[null,null,"22 Analisadores"]
[null,null,"23 Colorímetros"]
[null,null,"24 Conjuntos de anaeróbia"]
[null,null,"25 Contadores de células"]
[null,null,"26 Cromatógrafos"]
[null,null,"27 Eletroforese fotómetro de chama"]
[null,null,"28 Espectofotómetros"]
[null,null,"29 Microtomos\n…"]
[null,43334,"Mobiliário hospitalar",8]
[null,null,"1. Mobiliário de exames e cuidados:"]
[null,null,"11 Armários"]
[null,null,"12 Bancos para consulta"]
[null,null,"13 Candeeiros para observação"]
[null,null,"14 Carros de enfermagem"]
[null,null,"15 Carros unidose"]
[null,null,"16 Marquesas"]
[null,null,"17 Mesas de pensos"]
[null,null,"18 Vitrinas\n…"]
[null,null,"2. Mobiliário de alojamento:"]
[null,null,"21 Armários"]
[null,null,"22 Camas"]
[null,null,"23 Mesas -de -cabeceira"]
[null,null,"24 Material complementar do mobiliário de alojamento\n…"]
[null,43335,"43335 Equipamento de desinfeção, esterilização e incineração",6]
[null,null,"01 Aparelhos de ar estéril"]
[null,null,"02 Autoclaves"]
[null,null,"03 De desinfeção de camas"]
[null,null,"04 Equipamento de desinfeção do ar"]
[null,null,"05 Estufas calor seco"]
[null,null,"06 Incineradores"]
[null,null,"07 Instalação de fluxo laminar e outras\n…"]
[null,43336,"Equipamento específico de farmácia",5]
[null,null,"01 Armários"]
[null,null,"02 Emulsionadores"]
[null,null,"03 Máquinas de fabrico de comprimidos e supositórios\n…"]
[null,43337,"Equipamento de instrução médica",7]
[null,null,"01 Bombas de sangue simulado"]
[null,null,"02 Bonecos para instrução"]
[null,null,"03 Corações desmontáveis"]
[null,null,"04 Esqueletos"]
[null,null,"05 Modelos anatómicos\n…"]
[null,43338,"Vestuário e calçado",2]
[null,null,"01 Botas"]
[null,null,"02 Blusões"]
[null,null,"03 Casacos"]
[null,null,"04 Coberturas"]
[null,null,"05 Galochas"]
[null,null,"06 Malas"]
[null,null,"07 Roupa branca e atoalhados\n…"]
[null,43339,"Outro","(b)"]
[null,4334,"4334 Equipamento e material recreativo, desportivo, de educação e de cultura","Escolha sub-categoria"]
[null,43341,"43341 Equipamento recreativo, de educação física e desporto, incluindo mobiliário de apoio",8]
[null,null,"01 Aparelhos de remar"]
[null,null,"02 Aparelhos para exercícios (ginástica)"]
[null,null,"03 Armários"]
[null,null,"04 Balizas"]
[null,null,"05 Bancos suecos"]
[null,null,"06 Barras/traves"]
[null,null,"07 Bicicletas"]
[null,null,"08 Canas de pesca"]
[null,null,"09 Colchões de ginástica"]
[null,null,"10 Discos"]
[null,null,"11 Escadas"]
[null,null,"12 Halteres"]
[null,null,"13 Máscaras de esgrima"]
[null,null,"14 Mesas (apoio, bilhar, jogo, pingue -pongue)"]
[null,null,"15 Móveis para jardins e piscinas"]
[null,null,"16 Pranchas de surf"]
[null,null,"17 Raquetas"]
[null,null,"18 Redes"]
[null,null,"19 Sabres"]
[null,null,"20 Tabuleiros"]
[null,null,"21 Tapetes de ginástica\n…"]
[null,43342,"43342 Equipamento e dispositivos auxiliares de instrução, incluindo mobiliário e material escolar",6]
[null,null,"01 Aparelhos de Boyle -Mariotte"]
[null,null,"02 Ardósias"]
[null,null,"03 Caixas de sólidos geométricos"]
[null,null,"04 Calculadoras trigonométricas"]
[null,null,"05 Cartas geográficas"]
[null,null,"06 Carteiras escolares"]
[null,null,"07 Cronómetros"]
[null,null,"08 Gaiolas de Faraday"]
[null,null,"09 Giroscópios"]
[null,null,"10 Jogos didáticos"]
[null,null,"11 Modelos aerológicos"]
[null,null,"12 Modelos anatómicos"]
[null,null,"13 Modelos diversos"]
[null,null,"14 Planisférios"]
[null,null,"15 Quadros escolares"]
[null,null,"16 Quadros expositores de mapas"]
[null,null,"17 Quadros magnéticos"]
[null,null,"18 Relógios para instrução"]
[null,null,"19 Tesouras para trabalhos manuais\n…"]
[null,43343,"Equipamento e material audiovisual",5]
[null,null,"01 Amplificadores"]
[null,null,"02 Rádios"]
[null,null,"03 Colunas para reprodução de som"]
[null,null,"04 Comandos à distância"]
[null,null,"05 CDs"]
[null,null,"06 Discos"]
[null,null,"07 Ecrãs"]
[null,null,"08 Filmes"]
[null,null,"09 Gira -discos"]
[null,null,"10 Gravadores"]
[null,null,"11 Gravadores/reprodutores"]
[null,null,"12 Misturadores"]
[null,null,"13 Monitores"]
[null,null,"14 Projetores diversos"]
[null,null,"15 Retroprojetores"]
[null,null,"16 Sistemas de videocassetes"]
[null,null,"17 Televisores\n…"]
[null,43344,"Instrumentos musicais e equipamento de orquestra",8]
[null,null,"01 Acordeões"]
[null,null,"02 Adufes"]
[null,null,"03 Alaúdes"]
[null,null,"04 Amplificadores"]
[null,null,"05 Bancos"]
[null,null,"06 Bandoleiras"]
[null,null,"07 Bandolins"]
[null,null,"08 Barítonos"]
[null,null,"09 Baterias"]
[null,null,"10 Bombos"]
[null,null,"11 Caixas diversas"]
[null,null,"12 Carrilhões"]
[null,null,"13 Cavaquinhos"]
[null,null,"14 Celeste"]
[null,null,"15 Clarinetes"]
[null,null,"16 Clarins"]
[null,null,"17 Congas"]
[null,null,"18 Contrabaixos"]
[null,null,"19 Cornetins"]
[null,null,"20 Cravos"]
[null,null,"21 Estrados"]
[null,null,"22 Estantes de regência e estúdio"]
[null,null,"23 Estantes para partituras"]
[null,null,"24 Estantes portáteis"]
[null,null,"25 Estojos"]
[null,null,"26 Fagotes"]
[null,null,"27 Ferramentas de nivelamento de chaves"]
[null,null,"28 Flautas"]
[null,null,"29 Flautins"]
[null,null,"30 Fliscornes"]
[null,null,"31 Gaitas de foles"]
[null,null,"32 Guitarras"]
[null,null,"33 Harmónicas"]
[null,null,"34 Harpas"]
[null,null,"35 Liras"]
[null,null,"36 Macetas"]
[null,null,"37 Malas de transporte de partituras"]
[null,null,"38 Maracas"]
[null,null,"39 Marimbos"]
[null,null,"40 Martelos"]
[null,null,"41 Oboés"]
[null,null,"42 Ocarinas"]
[null,null,"43 Órgãos"]
[null,null,"44 Pífaros"]
[null,null,"45 Pratos"]
[null,null,"46 Requintas"]
[null,null,"47 Saxofones"]
[null,null,"48 Sinos"]
[null,null,"49 Sintetizadores de som"]
[null,null,"50 Sistros"]
[null,null,"51 Tambores"]
[null,null,"52 Timbales"]
[null,null,"53 Tripés"]
[null,null,"54 Trombones"]
[null,null,"55 Trompas"]
[null,null,"56 Trompetes"]
[null,null,"57 Tubas"]
[null,null,"58 Vibrafones"]
[null,null,"59 Violas"]
[null,null,"60 Violinos"]
[null,null,"61 Violoncelos"]
[null,null,"62 Xilofones\n…"]
[null,43345,"Livros, publicações e documentos","–"]
[null,null,"01 Cartas fotográficas"]
[null,null,"02 Cartas topográficas"]
[null,null,"03 Enciclopédias"]
[null,null,"04 Gravuras"]
[null,null,"05 Livros"]
[null,null,"07 Mapas"]
[null,null,"08 Revistas científicas e técnicas"]
[null,null,"09 Roteiros\n…"]
[null,43346,"Adereços teatrais",4]
[null,43349,"Outro","(b)"]
[null,4335,"4335 Equipamento e material para serviços de alimentação, rouparia e lavandaria","Escolha sub-categoria"]
[null,43351,"Equipamento de cozinha, bar e cafetaria",7]
[null,null,"01 Fogões"]
[null,null,"02 Loiças"]
[null,null,"03 Máquinas de lavar loiça"]
[null,null,"04 Material de empratamento e distribuição"]
[null,null,"05 Material de regeneração"]
[null,null,"06 Mobiliário de bar, cafetaria e refeitório"]
[null,null,"07 Talheres e utensílios idênticos de cozinha"]
[null,null,"08 Utensílios de cozinha (panelas, etc.)"]
[null,null,"09 Máquinas e aparelhos de cozinha"]
[null,null,"10 Máquinas de cafés"]
[null,null,"11 Máquinas de sumos\n…"]
[null,43352,"Equipamento de lavandaria e rouparia",7]
[null,null,"01 Calandras"]
[null,null,"02 Equipamento de confeção e reparação de roupa"]
[null,null,"03 Secadores"]
[null,null,"04 Túneis de lavagem"]
[null,null,"05 Ferro de engomar"]
[null,null,"06 Máquinas de costura"]
[null,null,"07 Máquinas de engomar"]
[null,null,"08 Máquinas de lavar e secar roupa"]
[null,null,"09 Tábua de engomar"]
[null,null,"10 Tanques\n…"]
[null,43353,"Equipamento de aquecimento, climatização e refrigeração",8]
[null,null,"01 Aquecedores"]
[null,null,"02 Arcas congeladoras"]
[null,null,"03 Climatizadores"]
[null,null,"04 Congeladores"]
[null,null,"05 Instalações de climatização e outras"]
[null,null,"06 Refrigeradores\n…"]
[null,43354,"Equipamento de limpeza e conservação",5]
[null,null,"01 Aspiradores"]
[null,null,"02 Carros"]
[null,null,"03 Enceradoras"]
[null,null,"04 Secadores"]
[null,null,"05 Toalheiros"]
[null,null,"06 Baldes e bacias"]
[null,null,"07 Varões"]
[null,null,"08 Bombas e máquinas de desentupir"]
[null,null,"09 Bebedores"]
[null,null,"10 Lavatórios\n…"]
[null,43355,"Material complementar de hotelaria",4]
[null,null,"01 Cobertores"]
[null,null,"02 Colchoaria\n…"]
[null,43359,"Outro","(b)"]
[null,4336,"4336 Equipamento para agricultura, pesca e jardinagem","Escolha sub-categoria"]
[null,43361,"43361 Máquinas e equipamento para preparação do solo e colheitas",7]
[null,null,"01 Abre -regos"]
[null,null,"02 Arados"]
[null,null,"03 Atrelados agrícolas"]
[null,null,"04 Ceifeiras, debulhadoras -enfardadeiras e outras"]
[null,null,"05 Descascadores"]
[null,null,"06 Enxadas"]
[null,null,"07 Foices"]
[null,null,"08 Máquinas de uso específico (apanhar batatas, espalhar feno, rechegar)\n…"]
[null,43362,"Equipamento para defesa de pragas, doenças e frio",5]
[null,null,"01 Armadilhas, caça de animais"]
[null,null,"02 Atomizadores"]
[null,null,"03 Bombas de pó"]
[null,null,"04 Eletrocutores de insetos"]
[null,null,"05 Equipamento para controlar a epizootia"]
[null,null,"06 Nebulizadores"]
[null,null,"07 Pulverizadores"]
[null,null,"08 Purificadores de mel"]
[null,null,"09 Ratoeiras\n…"]
[null,43363,"Utensílios e ferramentas para jardinagem",5]
[null,null,"01 Arrancadores de relva"]
[null,null,"02 Aspersores"]
[null,null,"03 Cortadores"]
[null,null,"04 Segadeiras de relva"]
[null,null,"05 Tesouras mecânicas"]
[null,null,"06 Utensílios e ferramentas de uso específico\n…"]
[null,43364,"Equipamento para indústria agrícola e pecuária",7]
[null,null,"01 Bebedouros/comedouros"]
[null,null,"02 Calibradores de ovos"]
[null,null,"03 Chocadeiras"]
[null,null,"04 Corta -forragens"]
[null,null,"05 Distribuidores automáticos de rações"]
[null,null,"06 Equipamento de ordenha"]
[null,null,"07 Equipamento especializado para o fabrico de vinho, azeite e cidra"]
[null,null,"08 Equipamento para abate de animais"]
[null,null,"09 Estufas"]
[null,null,"10 Extratores de mel"]
[null,null,"11 Máquinas de descaroçar e descascar"]
[null,null,"12 Máquinas para peneirar cereais"]
[null,null,"13 Moinhos"]
[null,null,"14 Pasteurizadores"]
[null,null,"15 Prensas\n…"]
[null,43365,"Equipamento para a indústria de pesca",5]
[null,null,"01 Aparelhos localizadores (sondas, sonares e sensores), de telefonia, de radiogoniometria e de radar"]
[null,null,"02 Aprestos de pesca"]
[null,null,"03 Cabo de aço para navios"]
[null,null,"04 Canhão sonda"]
[null,null,"05 GPS"]
[null,null,"06 Rede furuno\n…"]
[null,4337,"4337 Equipamento e material de apoio à produção","Escolha sub-categoria"]
[null,"43371.1","43371 Equipamento de produção e distribuição de energia elétrica",8]
[null,null,"1. Equipamento de valorização energética (incineração e biogás):"]
[null,null,"11 Caldeiras e sobreaquecedores"]
[null,null,"12 Desgaseificadores e reatores"]
[null,null,"13 Pontes rolantes"]
[null,null,"14 Separadores magnéticos"]
[null,null,"15 Transportadores de resíduos"]
[null,null,"16 Tremonhas de alimentação e remoção"]
[null,null,"17 Ventiladores\n…"]
[null,"43371.2","Equipamento de produção e distribuição de energia elétrica:",10]
[null,null,"21 Aparelhos de medida, de controlo e outros"]
[null,null,"22 Centrais elétricas em atrelados"]
[null,null,"23 Centrais hidroelétricas"]
[null,null,"24 Centrais termoelétricas\n…"]
[null,43372,"43372 Equipamento para tratamento e abastecimento de água","Escolha sub-categoria"]
[null,"43372.1","Equipamento eletromecânico dos sistemas de tratamento físico -químico:",8]
[null,null,"11 Arejadores"]
[null,null,"12 Bombas de doseamento"]
[null,null,"13 Bombas de recirculação e elevação"]
[null,null,"14 Compressores"]
[null,null,"15 Descalcificadores"]
[null,null,"16 Desferrizadores"]
[null,null,"17 Equipamento para osmose inversa"]
[null,null,"18 Medidores de caudal"]
[null,null,"19 Motores"]
[null,null,"10 Tamisadores e grelhas mecânicas de separação de sólidos\n…"]
[null,"43372.2","Equipamento para os sistemas de desinfeção:",10]
[null,null,"21 Bombas doseadoras de hipoclorito de sódio"]
[null,null,"22 Clorómetros"]
[null,null,"23 Ozonizadores"]
[null,null,"24 Reatores de ultravioletas\n…"]
[null,"43372.3","Equipamento para purificação de água:",8]
[null,null,"31 Depuradores"]
[null,null,"32 Aparelhos de medida e controlo"]
[null,null,"33 Equipamento para destilação e abastecimento de água"]
[null,null,"34 Máquinas de filtragem"]
[null,null,"35 Unidades de cloro, depuração e bombagem"]
[null,null,"36 Outras máquinas de uso específico\n…"]
[null,43373,"43373 Equipamento para recolha e tratamento de resíduos sólidos e efluentes","Escolha sub-categoria"]
[null,"43373.1","Equipamento de movimentação, compactação, prensagem e confinamento dresíduos:",8]
[null,null,"11 Equipamento de monitorização da qualidade das águas subterrâneas, do solo e do ar"]
[null,null,"12 Máquinas de movimentação"]
[null,null,"13 Prensas"]
[null,null,"14 Queimadores de biogás"]
[null,null,"15 Tapetes transportadores\n…"]
[null,"43373.2","Equipamento de tratamento de efluentes:",8]
[null,null,"21 Equipamento de uso específico\n…"]
[null,"43373.3","Equipamento de valorização biológica (compostagem e dig. anaeróbica):",8]
[null,null,"31 Compressores"]
[null,null,"32 Gasómetros"]
[null,null,"33 Mesas densimétricas"]
[null,null,"34 Tapetes transportadores"]
[null,null,"35 Trituradores"]
[null,null,"36 Ventiladores\n…"]
[null,"43373.4","Equipamento de valorização multimaterial:",8]
[null,null,"41 Contentores"]
[null,null,"42 Equipamento de enfardamento"]
[null,null,"43 Equipamento de transporte e recolha\n…"]
[null,43374,"43374 Equipamento para tratamento de emissões atmosféricas","Escolha sub-categoria"]
[null,"43374.1","Equipamento de tratamento de gases:",8]
[null,null,"11 Equipamento de absorção e poluentes gasosos"]
[null,null,"12 Incineradores de gases"]
[null,null,"13 Lavadores de gases"]
[null,null,"14 Precipitadores eletrostáticos"]
[null,null,"15 Ventiladores\n…"]
[null,"43374.2","Equipamento de monitorização da qualidade do ar:",8]
[null,null,"21 Equipamento de uso específico\n…"]
[null,43375,"Equipamento para a construção civil",8]
[null,null,"01 Andaimes"]
[null,null,"02 Aparelhos e materiais de ensaio e medida"]
[null,null,"03 Cofragens"]
[null,null,"04 Construções ligeiras não afetas a obras em curso"]
[null,null,"05 Equipamentos de trabalhos de escavação e terraplanagem, de sondagem e fundações para exploração de pedreiras, e aplicação de fabricação de betões e argamassas, construção de estradas e minas"]
[null,null,"06 Para obras hidráulicas"]
[null,null,"07 Ferramentas e utensílios individuais"]
[null,null,"08 Equipamento móvel transportado"]
[null,null,"09 Equipamentos de oficinas de carpintaria"]
[null,null,"10 Equipamentos de oficinas de serralharia"]
[null,null,"11 De produção e distribuição de energia elétrica"]
[null,null,"12 Equipamento para movimentação e armazenagem de"]
[null,null,"materiais"]
[null,null,"13 Equipamento para trabalhos de ar comprimido\n…"]
[null,43376,"43376 Equipamento para diversas indústrias","Escolha sub-categoria"]
[null,"43376.1","Equipamento de produção e distribuição de combustíveis e lubrificantes:",8]
[null,null,"11 Bombas"]
[null,null,"12 Equipamento de bombagem, canalização e distribuição de combustível\n…"]
[null,"43376.2","Fornos, instalações de vapor e equipamento de secagem industriais:",7]
[null,null,"21 Aquecedores e condensadores de vapor"]
[null,null,"22 Caldeiras"]
[null,null,"23 Desumidificadores e secadores"]
[null,null,"24 Estufas"]
[null,null,"25 Fornos industriais\n…"]
[null,"43376.3","Equipamento para limpeza industrial:",7]
[null,null,"31 Aparelhos de descontaminação e despiolhamento"]
[null,null,"32 Câmaras de desinfeção"]
[null,null,"33 Esterilizadores"]
[null,null,"34 Máquinas e utensílios para lavandaria e tinturaria"]
[null,null,"35 Máquinas para limpeza de instalações\n…"]
[null,"43376.4","Equipamento de transmissão de energia mecânica: \n…",7]
[null,"43376.5","Equipamento para manejo de transporte de materiais:",8]
[null,null,"51 Aparelhos elevadores"]
[null,null,"52 Cadernais"]
[null,null,"53 Carros de mão"]
[null,null,"54 Empilhadores manuais"]
[null,null,"55 Grampos e lingas"]
[null,null,"56 Gruas e paus de carga"]
[null,null,"57 Guinchos"]
[null,null,"58 Tapetes rolantes e telas transportadoras\n…"]
[null,"43376.6","Motores e turbinas (exclui motores elétricos):",7]
[null,null,"61 Máquinas alternativas a vapor"]
[null,null,"62 Motores para fins industriais e similares"]
[null,null,"63 Turbinas\n…"]
[null,"43376.7","Bombas e compressores:",7]
[null,null,"71 Bombas a motor"]
[null,null,"72 Bombas de vácuo"]
[null,null,"73 Bombas manuais"]
[null,null,"74 Compressores"]
[null,null,"75 Moto -bombas"]
[null,null,"76 Unidades de bombagem\n…"]
[null,"43376.8","Equipamento para a indústria elétrica e eletrónica:",4]
[null,null,"81 Ferramentas e equipamentos individuais"]
[null,null,"82 Máquinas de bobinar"]
[null,null,"83 Máquinas para fabrico de semicondutores, circuitos microeletrónicos e de placas de circuitos impressos"]
[null,null,"84 Moldes\n…"]
[null,"43376.9","Equipamento para as indústrias de borracha e do plástico:",7]
[null,null,"91 Moldes e formas"]
[null,null,"92 Prensas\n…"]
[null,"43376.10","Equipamento para a indústria do papel e tipografia:",10]
[null,null,"101 Geradores de vapores"]
[null,null,"102 Lixiviadores"]
[null,null,"103 Máquinas de Fabricação de pasta"]
[null,null,"104 Máquinas de Formação de folha de papel"]
[null,null,"105 Máquinas de Preparação e acabamento de papel"]
[null,null,"106 Máquinas de Transformação de papel"]
[null,null,"107 Aparelhagem eletrónica para comando, reprodução, iluminação e corte"]
[null,null,"108 Máquinas de composição e impressão"]
[null,"43376.11","11. Equipamento para a indústria de vidro, porcelana e faiança:",8]
[null,null,"111 Ferramentas e utensílios de uso específico"]
[null,null,"112 Máquinas para fabricar e polir artigos óticos"]
[null,null,"113 Máquinas para lapidar cristais de quartzo"]
[null,null,"114 Matrizes, moldes e tambores perfurados para fabrico"]
[null,null,"de vidro"]
[null,null,"115 Sopradores de vidro"]
[null,null,"116 Tesouras para desprender a gota do vidro"]
[null,null,"117 Transportadores"]
[null,null,"118 Fornos\n…"]
[null,"43376.12","Equipamento para trabalhar madeira:",7]
[null,null,"121 Berbequins"]
[null,null,"122 Caixa de ferramenta diversa para carpinteiro"]
[null,null,"123 Entalhadoras"]
[null,null,"124 Fresadoras"]
[null,null,"125 Lixadeiras, plainas e rebarbadoras"]
[null,null,"126 Máquinas de desbastar"]
[null,null,"127 Máquinas para fabrico de folheados, contraplacados e aglomerados de partículas e fibras de madeira"]
[null,null,"128 Serras e tornos mecânicos\n…"]
[null,"43376.13","Equipamento para trabalhar metais:",7]
[null,null,"131 Engenhos de furar"]
[null,null,"132 Equipamento de soldadura"]
[null,null,"133 Equipamento de verificação e calibragem"]
[null,null,"134 Equipamento e máquinas de fundição"]
[null,null,"135 Equipamento para tratamento e acabamento de metais"]
[null,null,"136 Ferramentas e utensílios de uso específico"]
[null,null,"138 Laminadoras e máquinas de estiramento"]
[null,null,"138 Máquinas e martelos de forjar, de moldar e cortar metais\n…"]
[null,"43376.14","Equipamento para as indústrias química e farmacêutica:",7]
[null,null,"141 Bombas de gás (petróleo)"]
[null,null,"142 Equipamento gerador de gás"]
[null,null,"143 Ferramentas e utensílios de uso específico"]
[null,null,"144 Máquinas para fabrico de explosivos e outros produtos químicos"]
[null,null,"145 Máquinas para refinação de petróleo"]
[null,null,"146 Máquinas e aparelhos de uso específico sujeitos a ambiente corrosivo"]
[null,null,"147 Prensas e equipamentos para o fabrico de comprimidos e especialidades farmacêuticas\n…"]
[null,"43376.15","Equipamento para as indústrias têxteis, de chapelaria, de vestuário e do couro:",8]
[null,null,"151 Caldeiras para a produção de vapor"]
[null,null,"152 Maquinaria para fabrico de cordas, cabos e redes"]
[null,null,"153 Maquinaria para fabrico de malhas"]
[null,null,"154 Máquinas e equipamento para a indústria de chapelaria e alfaiataria"]
[null,null,"155 Máquinas e equipamento para a indústria de vestuário e calçado"]
[null,null,"156 Máquinas para as indústrias de curtumes e de trabalhos em couro"]
[null,null,"157 Moldes e formas para calçado"]
[null,null,"158 Teares para a indústria de tapeçaria"]
[null,null,"159 Mobiliário de uso específico\n…"]
[null,"43376.16","Equipamentos para as indústrias de sabões, detergentes, óleos e gorduras animais ou vegetais não alimentares",8]
[null,"43376.17","Equipamento para fabrico de embalagens",8]
[null,null,"171 Máquinas industriais de agrafar, aparafusar, atar, colar, rotular e selar"]
[null,null,"172 Máquinas para fabricar contentores metálicos, tambores e outras embalagens\n…"]
[null,"43376.18","Equipamento para a indústria alimentar:",8]
[null,null,"181 Centrifugadoras"]
[null,null,"182 Ensacadores de frutas e legumes"]
[null,null,"183 Instalações frigoríficas e de refrigeração industriais"]
[null,null,"184 Máquinas de empacotar alimentos"]
[null,null,"185 Máquinas de fabricar gelo"]
[null,null,"186 Máquinas para preparação de alimentos"]
[null,null,"187 Misturadoras\n…"]
[null,43379,"Outro","(b)"]
[null,4338,"4338 Equipamento militar, de segurança e defesa","Escolha sub-categoria"]
[null,43381,"Equipamento de combate a incêndios",4]
[null,null,"01 Agulhetas"]
[null,null,"02 Escadas"]
[null,null,"03 Extintores"]
[null,null,"04 Jogos de equipamento de combate a incêndios"]
[null,null,"05 Machados"]
[null,null,"06 Unidades conversoras de espuma\n…"]
[null,43382,"Equipamento de segurança e salvamento",4]
[null,null,"1. Equipamento de segurança e salvamento:"]
[null,null,"11 Aparelhos respiratórios"]
[null,null,"12 Coletes de salvação"]
[null,null,"13 Equipamento de proteção contra agentes químicos"]
[null,null,"14 Equipamento de salvamento e arrombamento"]
[null,null,"15 Redes de segurança"]
[null,null,"16 Salva -vidas\n…"]
[null,null,"2. Equipamento marítimo de salvamento e segurança:"]
[null,null,"21 Aparelhos de salvamento"]
[null,null,"22 Balsas salva -vidas"]
[null,null,"23 Coletes de salvação"]
[null,null,"24 Redes de salvamento\n…"]
[null,43383,"Sistemas de sinalização e alarme",5]
[null,null,"01 Aparelhos de iluminação e segurança"]
[null,null,"02 Buzinas"]
[null,null,"03 Dispositivos de sinalização"]
[null,null,"04 Projetores"]
[null,null,"05 Sirenes"]
[null,null,"06 Triângulos de pré -sinalização\n…"]
[null,43384,"Armas de fogo, acessórios e embalagens para munições",7]
[null,null,"01 Acessórios de armas de fogo"]
[null,null,"02 Carabinas"]
[null,null,"03 Espingardas caçadeiras"]
[null,null,"04 Espingardas do tipo flash -ball"]
[null,null,"05 Metralhadoras"]
[null,null,"06 Pistolas metralhadoras"]
[null,null,"07 Pistolas"]
[null,null,"08 Revólveres"]
[null,null,"09 Almofadas para acondicionamento de munições"]
[null,null,"10 Caixas"]
[null,null,"11 Cilindros"]
[null,null,"12 Embalagens"]
[null,null,"13 Grades"]
[null,null,"14 Recipientes para acondicionamento de munições\n…"]
[null,43385,"Dispositivos de lançamento de foguetes, granadas, engenhos pirotécnicos, bombas e outros",6]
[null,null,"01 Dispositivos de lançamento"]
[null,null,"02 Projetores"]
[null,null,"03 Sequenciadores\n…"]
[null,43386,"Equipamento de camuflagem e simulação",7]
[null,null,"01 Alvos"]
[null,null,"02 Armamento"]
[null,null,"03 Comutadores de alvos"]
[null,null,"04 Equipamentos simulados"]
[null,null,"05 Mísseis guiados fictícios"]
[null,null,"06 Redes de camuflagem"]
[null,null,"07 Simuladores\n…"]
[null,43387,"Equipamento de direção de tiro",5]
[null,null,"01 Equipamento emissor"]
[null,null,"02 De radar"]
[null,null,"03 De sonar"]
[null,null,"04 Recetor de direção de tiro"]
[null,43388,"Equipamento especial de manutenção e reparação de armas",5]
[null,null,"01 Aparelhos de verificação"]
[null,null,"02 De reparação"]
[null,null,"03 De limpeza de armas\n…"]
[null,43389,"Equipamento de instrução de armamento",4]
[null,null,"01 De instrução de armas"]
[null,null,"02 De instrução de munições"]
[null,null,"03 De instrução de explosivos\n…"]
[null,433810,"Equipamento especializado para manuseamento e manutenção de munições e explosivos:",5]
[null,null,"01 Equipamento para manuseamento e utilização"]
[null,null,"02 Equipamento para revisão"]
[null,null,"03 Equipamento para ensaio"]
[null,null,"04 Equipamento para manutenção e reparação"]
[null,null,"05 Máquinas para carga e fabrico de munições\n…"]
[null,433811,"433811 Armamento diverso",7]
[null,null,"Armas de sinalização e pirotécnicas"]
[null,null,"02 Balões de barragem"]
[null,null,"03 Dispositivos de lança cabos"]
[null,null,"04 Facas de combate"]
[null,null,"05 Projetores pirotécnicos\n…"]
[null,4339,"4339 Outro equipamento básico","Escolha sub-categoria"]
[null,43391,"Equipamentos de matadouro",8]
[null,null,"01 Afiador de facas elétrico"]
[null,null,"02 Armário com escovas de limpeza para suínos"]
[null,null,"03 Aspirador com depósito de vácuo"]
[null,null,"04 Balanceadores"]
[null,null,"05 Batedeira de sangue com motor"]
[null,null,"06 Caldeiras de vapor"]
[null,null,"07 Carros de via aérea"]
[null,null,"08 Carros de via tubolar"]
[null,null,"09 Chambaris e carros"]
[null,null,"10 Compressores (frigoríficos e outros)"]
[null,null,"11 Conduta de ar"]
[null,null,"12 Cortinas de ar"]
[null,null,"13 Depiladoras mecânicas"]
[null,null,"14 Descalcificador de água"]
[null,null,"15 Elevadores articulados com ou sem motor"]
[null,null,"16 Escaldão (inox ou vapor)"]
[null,null,"17 Esterilizadores"]
[null,null,"18 Evaporadores"]
[null,null,"19 Ganchos"]
[null,null,"20 Tina elétrica ou manual"]
[null,null,"21 Lavatórios inox com ou sem esterilizadores"]
[null,null,"22 Máquinas anetra especial"]
[null,null,"23 Máquinas de agrafos manual ou automática"]
[null,null,"24 Máquinas de dobradas"]
[null,null,"25 Máquinas de esfola"]
[null,null,"26 Máquinas de lavar botas automática"]
[null,null,"27 Máquinas de lavar jaulas"]
[null,null,"28 Máquinas de lavar moelas"]
[null,null,"29 Máquinas de partir cabeças"]
[null,null,"30 Mesas de inox ou ferro"]
[null,null,"31 Passadeiras rolantes"]
[null,null,"32 Plataformas"]
[null,null,"33 Posto de narcotização"]
[null,null,"34 Quadro elétrico para serra bovinos"]
[null,null,"35 Rolo de penas com motor"]
[null,null,"36 Serras de corte"]
[null,null,"37 Sistema de pesagem e etiquetagem"]
[null,null,"38 Tanque de imersão inox"]
[null,null,"39 Termoacumulador de vapor"]
[null,null,"40 Transportadora aérea com ou sem motor"]
[null,null,"41 Transportadores com estrutura reforçada\n…"]
[null,43392,"43392 Equipamentos de jogo","Escolha sub-categoria"]
[null,"43392.1","Equipamento adstrito às salas de jogos tradicionais e máquinas de jogo:",8]
[null,null,"11 Balanças para pesar fichas metálicas, máquinas de contar fichas, máquinas de contar e empacotar fichas e máquinas de contar notas"]
[null,null,"12 Bancadas para suporte das máquinas de jogo"]
[null,null,"13 Bancos e cadeiras, metálicos e de madeira, para profissionais e frequentadores das salas de jogos"]
[null,null,"14 Bolas de marfim ou material equivalente, bolas de borracha para boule, dados para banca francesa e craps, com estojo e marcas para este jogo e para os jogos de ponta e banca e chuck -luck"]
[null,null,"15 Caixas metálicas para composição do jogo de black-jack/21, tabuleiros em madeira e metálicos para fichas e recetáculos para recolha da receita das máquinas de jogos"]
[null,null,"16 Caixas metálicas para gratificações e caixas cilíndricas, metálicas, para descarte no jogo de bacará"]
[null,null,"17 Campânula especial para o jogo do cussec"]
[null,null,"18 Carros para transporte de fichas e carros para venda das mesmas"]
[null,null,"19 Ficheiro metálico e plástico, cunhos e moldes para as fichas"]
[null,null,"110 Malas em couro para ficheiros volantes"]
[null,null,"111 Máquinas de jogo"]
[null,null,"112 Mesas de jogo e respetivos acessórios, incluindo o tampo"]
[null,null,"113 Raquetes, stiks e paletes"]
[null,null,"114 Roletas americanas ou francesas completas (aparelhos com o respetivo cepo)"]
[null,null,"115 Sabots, expositores para roleta americana e painéis indicadores dos números das bancas"]
[null,null,"116 Tubo recurvado córneo e copo de cabedal e suporte metálico, para banca francesa e puxador para o boule\n…"]
[null,"43392.2","Equipamento de jogo adstrito às salas de jogo do bingo:",10]
[null,null,"21 Aparelhos eletrónicos, informáticos, de som, cinema, TV, quadros elétricos e painéis eletrónicos"]
[null,null,"22 Máquinas de extração de bolas do jogo do bingo e telecheques"]
[null,null,"23 Mesas de controlo (completas) e dos caixas do jogo do bingo"]
[null,null,"24 Suportes metálicos para os monitores, porta -cartões e sinalizadores de prémios de linha e bingo\n…"]
[null,434,"434 Equipamento de transporte","Escolha sub-categoria"]
[null,4341,"4341 Transportes ferroviários","Escolha sub-categoria"]
[null,"4341.1","Locomotivas",13]
[null,"4341.2","Vagões",20]
[null,"4341.3","Carruagens",20]
[null,"4341.4","Automotoras",13]
[null,"4341.5","Material de carga e descarga",12]
[null,"4341.6","Equipamento de construção de vias de caminho -de-ferro",8]
[null,"4341.7","Equipamento de manutenção de vias de caminho-de-ferro",8]
[null,"4341.8","Cubas cisternas e frigoríficos \n…",16]
[null,4342,"4342 Transportes rodoviários","Escolha sub-categoria"]
[null,43421,"Veículos automóveis ligeiros e mistos de passageiros",4]
[null,43422,"Veículos automóveis pesados de passageiros",7]
[null,43423,"Veículos automóveis de mercadorias (ligeiros e pesados)",5]
[null,43424,"Veículos automóveis hospitalares",4]
[null,43425,"Veículos automóveis de combate a incêndios e proteção civil",4]
[null,43426,"Motos, bicicletas e motociclos",7]
[null,43427,"Veículos automóveis agrícolas",6]
[null,43428,"Veículos automóveis de recolha e transporte de lixo e limpeza de ruas",4]
[null,43429,"Outros","(b)"]
[null,4343,"4343 Transportes marítimos e fluviais","Escolha sub-categoria"]
[null,43431,"43431 Veículos","Escolha sub-categoria"]
[null,"43431.1","Barcos de borracha",8]
[null,"43431.2","Barcos de ferro",14]
[null,"43431.3","Barcos de madeira",10]
[null,"43431.4","Navios \n…",10]
[null,43432,"Equipamento de apoio a embarcações",8]
[null,null,"01 Equipamento de propulsão"]
[null,null,"02 Equipamento de salva -vidas"]
[null,null,"03 Equipamento marítimo"]
[null,null,"04 Ferros"]
[null,null,"05 Jangadas"]
[null,null,"06 Máquinas de convés"]
[null,null,"07 Mastros\n…"]
[null,43433,"Equipamento de instrução de navegação marítima",5]
[null,null,"01 Simuladores\n…"]
[null,4344,"4344 Transportes aéreos","Escolha sub-categoria"]
[null,43441,"43441 Veículos","Escolha sub-categoria"]
[null,"43441.1","Aviões (motores de reação)",6]
[null,"43441.2","Aviões (motores de turbo -hélice)",6]
[null,"43441.3","Aviões (motores convencionais)",4]
[null,"43441.4","Helicópteros \n…",6]
[null,43442,"Equipamento de apoio",7]
[null,null,"01 Equipamento de estabilização automática"]
[null,null,"02 Equipamento de fixação de carga"]
[null,null,"03 Paraquedas\n…"]
[null,43443,"Equipamento de instrução de aeronaves \n…",7]
[null,43481,"4348 Viaturas militares",4]
[null,null,"Veículos \n01 …\n…"]
[null,43442,"Equipamento de apoio \n01 …\n…",10]
[null,4349,"4349 Outros equipamentos de transporte","Escolha sub-categoria"]
[null,"4349.1","Atrelados",6]
[null,"4349.2","Bicicletas",4]
[null,"4349.3","Plataformas",7]
[null,"4349.4","Veículos de tração animal \n…",8]
[null,435,"435 Equipamento administrativo","Escolha sub-categoria"]
[null,4351,"4351 Equipamento informático e de telecomunicações","Escolha sub-categoria"]
[null,43511,"Equipamento informático",4]
[null,null,"01 Bastidores (armário)"]
[null,null,"02 Computadores"]
[null,null,"03 Equipamento de rede"]
[null,null,"04 Equipamento de Switching"]
[null,null,"05 Gravadores de CD -ROM"]
[null,null,"06 HUB"]
[null,null,"07 Impressoras"]
[null,null,"08 Leitores de CD -ROM"]
[null,null,"09 Leitores óticos"]
[null,null,"10 Microcomputadores"]
[null,null,"11 Minicomputadores"]
[null,null,"12 Modems"]
[null,null,"13 Monitores"]
[null,null,"14 Multiplexores"]
[null,null,"15 Outros periféricos"]
[null,null,"16 PC portáteis"]
[null,null,"17 Perfuradores"]
[null,null,"18 Projetores de imagem de ecrã (data display)"]
[null,null,"19 Router"]
[null,null,"20 Scanners (digitalizador de imagem"]
[null,null,"21 Teclados"]
[null,null,"22 Terminais"]
[null,null,"23 Traçadores de gráficos (plotters)"]
[null,null,"24 Unidades de banda"]
[null,null,"25 Unidades centrais de processamento"]
[null,null,"26 Unidades de controlo"]
[null,null,"27 Unidades de disco\n…"]
[null,43512,"Equipamento de telecomunicações",5]
[null,null,"01 Central telefónica (PPCA)"]
[null,null,"02 Consola de gestão/operação rede rádio"]
[null,null,"03 Equipamento criptográfico e componentes de codificação"]
[null,null,"e descodificação"]
[null,null,"04 Equipamento de imagem e radares"]
[null,null,"05 Equipamento de navegação por satélite"]
[null,null,"06 Equipamento de radiocomunicações e segurança de vídeo"]
[null,null,"07 Equipamento de radionavegação"]
[null,null,"08 Equipamento de registo e de reprodução de som"]
[null,null,"09 Equipamento de supervisão e controlo"]
[null,null,"10 Modem"]
[null,null,"11 Repetidores rádio"]
[null,null,"12 Telecopiadores (fax)"]
[null,null,"13 Telefones"]
[null,null,"14 Telemóveis"]
[null,null,"15 IPAD"]
[null,null,"16 Terminal de rádio base (fixo)"]
[null,null,"17 Terminal de rádio móvel"]
[null,null,"18 Terminal de rádio portátil"]
[null,null,"19 Terminal micro -ondas"]
[null,null,"20 Terminal telefónico"]
[null,null,"21 Torre de comunicações e antenas\n…"]
[null,43513,"Dispositivos de comunicações com fibras óticas \n…",8]
[null,4352,"4352 Equipamento de escritório e de reprografia","Escolha sub-categoria"]
[null,43521,"Máquinas e equipamento de escritório",8]
[null,null,"01 Agrafadores"]
[null,null,"02 Aguçadeiras"]
[null,null,"03 Datadores/numeradores"]
[null,null,"04 De calcular"]
[null,null,"05 De contabilidade"]
[null,null,"06 De escrever"]
[null,null,"07 De franquiar"]
[null,null,"08 Furadores"]
[null,null,"09 Registadoras"]
[null,null,"10 Selos brancos e sinetas"]
[null,null,"11 Outras máquinas e aparelhos\n…"]
[null,43522,"Equipamento de reprografia",5]
[null,null,"01 Fotocopiadoras"]
[null,null,"02 Duplicadores"]
[null,null,"03 Guilhotinas"]
[null,null,"04 Máquinas de composição"]
[null,null,"05 Máquinas de encadernar"]
[null,null,"06 Máquinas heliográficas\n…"]
[null,4353,"Mobiliário de escritório e de arquivo",8]
[null,null,"01 Armário"]
[null,null,"02 Bancos"]
[null,null,"03 Biombos"]
[null,null,"04 Blocos de gavetas"]
[null,null,"05 Cadeiras"]
[null,null,"06 Cofres"]
[null,null,"07 Divisórias amovíveis"]
[null,null,"08 Estantes"]
[null,null,"09 Ficheiros"]
[null,null,"10 Mesas"]
[null,null,"11 Placards"]
[null,null,"12 Secretárias"]
[null,null,"13 Sofás\n…"]
[null,4359,"Outro","(b)"]
[null,436,"436 Equipamentos biológicos","Escolha sub-categoria"]
[null,4361,"Animais (de trabalho)",8]
[null,4362,"Plantas",4]
[null,4369,"Outros equipamentos biológicos","(b)"]
[null,437,"437 Outros ativos fixos tangíveis","Escolha sub-categoria"]
[null,4371,"4371 Equipamento de oficina de reparações","Escolha sub-categoria"]
[null,43711,"Mobiliário de oficina",8]
[null,null,"01 Bancadas"]
[null,null,"02 Cavaletes"]
[null,null,"03 Meses"]
[null,null,"04 Painéis"]
[null,null,"05 Pranchetas\n…"]
[null,43712,"Ferramentas, utensílios e máquinas ligeiras",5]
[null,43719,"Outro","(b)"]
[null,4372,"4372 Equipamento de decoração e conforto, de utilização comum","Escolha sub-categoria"]
[null,43721,"Mobiliário e equipamento comum (excluindo mobiliário de escritório)",8]
[null,null,"01 Aparadores"]
[null,null,"02 Armários"]
[null,null,"03 Bancos"]
[null,null,"04 Baús"]
[null,null,"05 Beliches"]
[null,null,"06 Bengaleiros"]
[null,null,"07 Cadeiras"]
[null,null,"08 Camas"]
[null,null,"09 Cofres"]
[null,null,"10 Colchões"]
[null,null,"11 Cómodas"]
[null,null,"12 Divãs"]
[null,null,"13 Escadotes"]
[null,null,"14 Escrivaninha"]
[null,null,"15 Espelho"]
[null,null,"16 Estantes"]
[null,null,"17 Guarda -fatos"]
[null,null,"18 Guaritas e outro equipamento de uso em aquartelamento"]
[null,null,"19 Maples"]
[null,null,"20 Mesas"]
[null,null,"21 Papeleiras"]
[null,null,"22 Prateleiras"]
[null,null,"23 Secretárias"]
[null,null,"24 Sofás"]
[null,null,"25 Toucadores"]
[null,null,"26 Vitrinas\n…"]
[null,43722,"Artigos honoríficos e eclesiásticos",8]
[null,null,"01 Hastes, mastros e lanças"]
[null,null,"02 Bandeiras"]
[null,null,"03 Taças e medalhas"]
[null,null,"04 Mobiliário e equipamento religioso"]
[null,null,"05 Utensílios de culto"]
[null,null,"06 Estuário litúrgico\n…"]
[null,43723,"Utensílios de decoração e conforto (utilização comum)",4]
[null,null,"01 Alcatifas"]
[null,null,"02 Bibelots"]
[null,null,"03 Candelabros"]
[null,null,"04 Carpetes"]
[null,null,"05 Castiçais"]
[null,null,"06 Cinzeiros"]
[null,null,"06 Cobertas"]
[null,null,"07 Cobertores"]
[null,null,"09 Colchas"]
[null,null,"10 Fronhas"]
[null,null,"11 Jarrões"]
[null,null,"12 Jogos de Tapetes"]
[null,null,"13 Conjuntos para lareira"]
[null,null,"14 Lençóis"]
[null,null,"15 Quadros e molduras"]
[null,null,"16 Reposteiros, toldos, estores, cortinas e cortinados"]
[null,null,"17 Sacos cama"]
[null,null,"18 Toalhas"]
[null,null,"19 Varões"]
[null,null,"20 Vasos\n…"]
[null,43724,"Equipamento e dispositivos de iluminação",8]
[null,null,"01 Aparelhos de iluminação não elétrica"]
[null,null,"02 Armaduras para lâmpadas fluorescentes"]
[null,null,"03 Candeeiros"]
[null,null,"04 Holofotes e projetores"]
[null,null,"05 Refletores\n…"]
[null,43725,"Equipamento de ar condicionado e de circulação de ar",8]
[null,null,"01 Aparelhos de are condicionado"]
[null,null,"02 Climatizadores"]
[null,null,"03 Condicionadores"]
[null,null,"04 Desumidificadores"]
[null,null,"05 Dispositivos de controlo de poeiras"]
[null,null,"06 Equipamento de purificação do ar"]
[null,null,"07 Exaustores"]
[null,null,"08 Humidificadores"]
[null,null,"09 Portas isotérmicas"]
[null,null,"10 Refrigeradores"]
[null,null,"11 Secadores"]
[null,null,"12 Sifões"]
[null,null,"13 Torres de arrefecimento"]
[null,null,"14 Ventiladores e ventoinhas"]
[null,43726,"Equipamento de aquecimento de ambiente e aquecedores de água domésticos",8]
[null,null,"01 Alimentadores"]
[null,null,"02 Aquecedores"]
[null,null,"03 Caldeiras"]
[null,null,"04 Caloríficos"]
[null,null,"05 Coletores e painéis solares"]
[null,null,"06 Convetores"]
[null,null,"07 Escalfetas"]
[null,null,"08 Esquentadores"]
[null,null,"09 Foções de sala"]
[null,null,"10 Fornalhas"]
[null,null,"11 Fornos"]
[null,null,"12 Lareiras e recuperadores de calor"]
[null,null,"13 Radiadores"]
[null,null,"14 Vaporizadores\n…"]
[null,43729,"Outro","(b)"]
[null,4373,"4373 Equipamento individual para fins especiais","Escolha sub-categoria"]
[null,43731,"Equipamento especial de proteção individual",4]
[null,null,"01 Armaduras de proteção"]
[null,null,"02 Binóculos"]
[null,null,"03 Vestuário de calçado de mergulhador"]
[null,null,"04 Braçais refletores"]
[null,null,"05 Câmaras de mergulhador"]
[null,null,"06 Capacetes e viseiras"]
[null,null,"07 Coletes refletores"]
[null,null,"08 Máscaras"]
[null,null,"09 Porta -alicate de corte\n…"]
[null,43732,"Equipamento especial de polícia",4]
[null,null,"01 Alcoolímetros"]
[null,null,"02 Algemas"]
[null,null,"03 Balança para pesar viaturas"]
[null,null,"04 Bastões luminosos"]
[null,null,"05 Capacetes e coletes de proteção anti bala"]
[null,null,"06 Carreiras de tiro móveis"]
[null,null,"07 Cassetetes"]
[null,null,"08 Equipamento para buscas e pesquisas policiais"]
[null,null,"09 Equipamento para controlo de viaturas"]
[null,null,"10 Lanternas"]
[null,null,"11 Mangas para treino de cães polícias"]
[null,null,"12 Megafones"]
[null,null,"13 Raquetes stop\n…"]
[null,43733,"Equipamento para prática desportiva",4]
[null,null,"01 Bastões para esqui"]
[null,null,"02 Malas de viagem"]
[null,null,"03 Mochilas de armação"]
[null,null,"04 Patins\n…"]
[null,43734,"Vestuário, calçado e outros fardamentos (incluindo para prática desportiva)",2]
[null,43735,"Equipamento para animais",7]
[null,null,"01 Equipamento de ordem pública para animais"]
[null,null,"02 Equipamento de treino para animais"]
[null,43739,"Outro","(b)"]
[null,4374,"Equipamento para acondicionamento de embalagem",6]
[null,null,"01 Contentores, tambores e outras embalagens"]
[null,null,"02 Máquinas de selar e rotular"]
[null,null,"03 Máquinas para acondicionamento ou embalagem"]
[null,null,"04 Taras e vasilhame\n…"]
[null,4378,"Outros","(b)"]
[null,44,"44 Ativos intangíveis","Escolha sub-categoria"]
[null,440,"Ativos intangíveis de domínio público, património histórico, artístico e cultural","–"]
[null,441,"Goodwill",10]
[null,442,"Projetos de Desenvolvimento",3]
[null,443,"443 Programas de computador e sistemas de informação","(c)"]
[null,444,"444 Propriedade industrial e intelectual","(c)"]
[null,449,"Outros ativos intangíveis","(b)"]

{"sheet":"Equip. Useful Life Table IST-ID","index":12,"n_rows":162,"n_cols":7,"rows_kept":162,"merged":[[0,1,0,6],[1,0,3,0],[1,1,2,2],[1,3,2,3],[1,4,2,4],[1,5,1,6],[3,1,3,6],[23,1,23,6],[53,1,53,6],[111,1,111,6],[128,1,128,6],[157,1,157,6]]}
[null,"DEPRECIATION TABLE FOR EQUIPMENTS IST-ID"]
["Coluna de apoio ocultada, não utilizar","EQUIPMENT CODE",null,"TYPE","EQUIPMENT DESCRIPTION","USEFUL LIFE"]
[{"$nulls":5},"YEARS","TAXA"]
[null,"GRUPO 1 - IMÓVEIS"]
[20050001,20050001,"EDIFICAÇÕES LIGEIRAS",2005,"EDIFICACOES LIGEIRAS (FIBROC.,MAD., ETC)",10,10]
[20100001,20100001,"HABITACIONAIS",2010,"EDIFICIOS HABITACIONAIS",50,2]
[20150001,20150001,"COMERCIAIS E ADMINISTRATIVOS",2015,"EDIFICIOS COMERCIAIS E ADMINISTRATIVOS",50,2]
[20200001,20200001,"INDUST. OU EDIF. INTEG. EM CONJ. INDUST.",2020,"EDIFICIOS INDUSTRIAIS",20,5]
[20250001,20250001,"AFECTOS SERV. ENS.",2025,"EDIFICIOS AFECTOS A HOTEIS, REST., ETC.",20,5]
[20250002,20250002,"EDIFÍCIOS ALHEIOS",2025,"EDIFICIOS AFECTOS A HOTEIS, REST., ETC.",20,5]
[20250003,20250003,"TERRENO",2025,"EDIFICIOS AFECTOS A HOTEIS, REST., ETC.",0]
[20350001,20350001,"FORNOS",2035,"FORNOS",10,10]
[20400001,20400001,"OBRAS HIDRÁULICAS, INC. POÇOS DE ÁGUA",2040,"OBRAS HIDRAULICAS, INC. POCOS DE AGUA",20,5]
[20450001,20450001,"OBRAS DE PAVIMENTAÇÃO",2045,"OBRAS DE PAVIMENTACAO DE PEDRA,BETAO,ETC",20,5]
[20500001,20500001,"BETÃO OU ALVENARIA",2050,"PONTES E AQUEDUTOS DE BETAO OU ALVENARIA",30,3.333333333]
[20550001,20550001,"MADEIRA",2055,"PONTES E AQUEDUTOS DE MADEIRA",5,20]
[20600001,20600001,"METÁLICOS",2060,"PONTES E AQUEDUTOS METALICOS",12,8.333333333]
[20650001,20650001,"RESERVATÓRIOS DE ÁGUA TORRE OU SUPERFÍCIE",2065,"RESERVATORIOS DE AGUA DE TORRE OU SUPERF",20,5]
[20700001,20700001,"RESERVATÓRIOS ÁGUA SUBTERRÃNEOS",2070,"RESERVATORIOS DE AGUA SUBTERRANEOS",30,3.333333333]
[20750001,20750001,"SILOS",2075,"SILOS",20,5]
[20800001,20800001,"ARRANJOS URBANÍSTICOS",2080,"ARRANJOS URBANISTICOS",10,10]
[20850001,20850001,"VEDAÇÕES LIGEIRAS",2085,"VEDACOES LIGEIRAS",12,8.333333333]
[20900001,20900001,"MUROS",2090,"MUROS",20,5]
[20950001,"GRUPO 2 - INSTALAÇÕES"]
[20950002,20950001,"INSTAL. ÁGUA, ELECTRIC., AR COMPRIMIDO, REFRIG. E TELEFÓNICAS",2095,"INST. AGUA,ELECT.,AR COMP.,REFRIG.E TELF",10,10]
[20950003,20950002,"INSTAL. ÁGUA, ELECTRIC., AR COMPRIMIDO, REFRIG. E TELEFÓNICAS",2095,"INST. AGUA,ELECT.,AR COMP.,REFRIG.E TELF",10,10]
[21000001,20950003,"REDES INFORMATICAS",2095,"INST. AGUA,ELECT.,AR COMP.,REFRIG.E TELF",10,10]
[21000002,21000001,"INSTALAÇÕES DE AQUECIMENTO CENTRAL",2100,"INSTALOCOES DE AQUECIMENTO CENTRAL",15,6.666666667]
[21050001,21000002,"INSTALAÇÕES DE AQUECIMENTO CENTRAL",2100,"INSTALOCOES DE AQUECIMENTO CENTRAL",15,6.666666667]
[21100001,21050001,"ASCENSORES, MONTA-CARGAS E ESCADAS MECÃNICAS",2105,"ASCENSORES, MONTA-CARGAS E ESCADAS MECAN",10,10]
[21150001,21100001,"INSTALAÇÕES DE CABOS AÉREOS E SUPORTES",2110,"INST. DE CABOS AEREOS E SUPORTES",10,10]
[21200001,21150001,"CALDEIRAS E ALAMBIQUES",2115,"INSTALACAO DE CALDEIRAS E ALAMBIQUES",14,7.142857143]
[21250001,21200001,"INSTALAÇÕES DE CAPTAÇÃO E DISTRIBUIÇÃO DE ÁGUA",2120,"INST. DE CAPTACAO E DIST. DE AGUA(PRIV.)",20,5]
[21300001,21250001,"INSTALAÇÕES DE CARGA, DESCARGA E EMBARQUE",2125,"INST. DE CARGA, DESCARGA, E EMBARQUE",14,7.142857143]
[21300002,21300001,"CENTRAIS TELEFÓNICAS PRIVATIVAS",2130,"CENTRAIS TELEFONICAS PRIVATIVAS",10,10]
[21350001,21300002,"CENTRAIS TELEFÓNICAS PRIVATIVAS",2130,"CENTRAIS TELEFONICAS PRIVATIVAS",10,10]
[21400001,21350001,"INSTALAÇÕES DE DISTRIBUIÇÃO DE COMBUSTÍVEIS",2135,"INST. DE DISTRIBUICAO COMBUSTIVEIS LIQ.",10,10]
[21450001,21400001,"INSTALAÇÕES DE EMBALAGEM",2140,"INST. DE EMBALAGEM",10,10]
[21500001,21450001,"INSTAL. DE ARMAZ. E DEPÓSITO DE BETÃO",2145,"INST. DE ARMAZ. E DE DEPOSITO DE BETAO",20,5]
[21550001,21500001,"INSTALAÇÕES DE ARMAZ. E DEPÓSITO DE MADEIRA",2150,"INST. DE ARMAZ. E DE DEPOSITO DE MADEIRA",15,6.666666667]
[21600001,21550001,"INSTALAÇÕES DE ARMAZ. E DEPÓSITO METÁLICOS",2155,"INST. DE ARMAZ. E DE DEPOSITO METALICOS",12,8.333333333]
[21650001,21600001,"LAGARES E PRENSAS",2160,"INSTALACOES DE LAGARES E PRENSAS",14,7.142857143]
[21700001,21650001,"POSTOS DE TRANSFORMAÇÃO",2165,"POSTOS DE TRANSFORMACAO",20,5]
[21700002,21700001,"INST. RADIOFÓNICAS, RADIOTELEG. E DE TELEVISÃO",2170,"RADIOFONICAS, RADIOTEL.E TELEVISAO(PRIV)",8,12.5]
[21700003,21700002,"INST. RADIOF., RADIOTEL., TELEV. (PRIVAT.)",2170,"RADIOFONICAS, RADIOTEL.E TELEVISAO(PRIV)",8,12.5]
[21750001,21700003,"INST. RADIOF., RADIOTEL., TELEV. (PRIVAT.)",2170,"RADIOFONICAS, RADIOTEL.E TELEVISAO(PRIV)",8,12.5]
[21800001,21750001,"REFEITÓRIOS E COZINHAS PRIVATIVAS",2175,"REFEITORIOS E COZINHAS PRIVATIVAS",10,10]
[21850001,21800001,"RESERVATÓRIOS PARA COMBUSTÍVEIS LÍQUIDOS",2180,"RESERVATORIOS P/ COMBUSTIVEIS LIQUIDOS",15,6.666666667]
[21860001,21850001,"VITRINES E ESTANTES FIXAS",2185,"VITRINAS E ESTANTES FIXAS",8,12.5]
[21860002,21860001,"ESPAÇOS EXPOSITIVOS",2186,"ESPAÇOS EXPOSITIVOS CARÁCTER ITINERANTE",4,25]
[21900001,21860002,"ESPAÇOS EXPOSITIVOS",2186,"ESPAÇOS EXPOSITIVOS CARÁCTER ITINERANTE",4,25]
[21950001,21900001,"INSTALAÇÕES DE CENTROS DE FORMAÇÃO PROFISSIONAL",2190,"INST.DE CENTROS DE FORMACAO PROFISSIONAL",6,16.66666667]
[22000001,21950001,"NÃO ESPECIFICADAS",2195,"NÃO ESPECÍFICADAS",10,10]
[22000002,"GRUPO 3 - MÁQUINAS, APARELHOS E FERRAMENTAS"]
[22000003,22000001,"APARELHAGEM  MÁQ. ELECTRÓN. (EQUIP. BÁSICO)",2200,"APARELHAGEM E MÁQUINAS ELECTRÓNICAS",5,20]
[22000004,22000002,"APARELHAGEM MÁQ. ELECTRÓN. (EQUIP. ADMINIST.)",2200,"APARELHAGEM E MÁQUINAS ELECTRÓNICAS",5,20]
[22000005,22000003,"APARELHAGEM MÁQ. ELECTRÓN. (OUTROS)",2200,"APARELHAGEM E MÁQUINAS ELECTRÓNICAS",5,20]
[22050001,22000004,"MAQUINAS FOTOGRAFICAS (EQ. BASICO)",2200,"APARELHAGEM E MÁQUINAS ELECTRÓNICAS",5,20]
[22050002,22000005,"EQUIPAMENTO SEGURANÇA (EQUIP BASICO)",2200,"APARELHAGEM E MÁQUINAS ELECTRÓNICAS",5,20]
[22100001,22050001,"APARELHAGEM DE REPRODUÇÃO DE SOM (EQ. BÁSICO",2205,"APARELHAGEM DE REPRODUCAO DE SOM",5,20]
[22100002,22050002,"APARELHAGEM DE REPRODUÇAÕ DE SOM (OUTROS)",2205,"APARELHAGEM DE REPRODUCAO DE SOM",5,20]
[22150001,22100001,"APARELHOS DE AR CONDICIONADO (EQUIP. ADMINIST.)",2210,"APARELHOS AR CONDICIONADO",8,12.5]
[22150002,22100002,"APARELHOS DE AR CONDICIONADO (EQ BÁSICO)",2210,"APARELHOS AR CONDICIONADO",8,12.5]
[22150003,22150001,"APARELHOS DE AQUECIMENTO (OUTROS)",2215,"APARELHOS AQUECIMENTO",8,12.5]
[22200001,22150002,"APARELHOS DE AQUECIMENTO (EQUIP. ADMIN.)",2215,"APARELHOS AQUECIMENTO",8,12.5]
[22250001,22150003,"APARELHOS DE AQUECIMENTO (EQUIP. BÁSICO)",2215,"APARELHOS AQUECIMENTO",8,12.5]
[22300001,22200001,"APARELHOS DE LABORATÓRIO E PRECISÃO (EQUIP. BÁSICO)",2220,"APARELHOS DE LABORATÓRIO E PRECISÃO",7,14.28571429]
[22350001,22250001,"APARELHOS DE VENTILAÇÃO",2225,"APARELHOS VENTILACAO",8,12.5]
[22350002,22300001,"BALANÇAS (EQ. BÁSICO)",2230,"BALANÇAS",8,12.5]
[22400001,22350001,"COMPRESSORES (EQUIP. BÁSICO)",2235,"COMPRESSORES",4,25]
[22400002,22350002,"COMPRESSORES",2235,"COMPRESSORES",4,25]
[22400003,22400001,"COMPUTADORES (EQUIP. BÁSICO)",2240,"COMPUTADORES",3,33.33333333]
[22400004,22400002,"COMPUTADORES (EQUIP. ADMINISTRATIVO)",2240,"COMPUTADORES",3,33.33333333]
[22400005,22400003,"PORTATIL (EQ. BÁSICO)",2240,"COMPUTADORES",3,33.33333333]
[22400006,22400004,"TABLET (EQ. BÁSICO)",2240,"COMPUTADORES",3,33.33333333]
[22400007,22400005,"MONITOR (EQ. BÁSICO)",2240,"COMPUTADORES",3,33.33333333]
[22400011,22400006,"IMPRESSORA (EQ. BÁSICO)",2240,"COMPUTADORES",3,33.33333333]
[22400012,22400007,"EQ. INFORMÁTICO OUTRO (EQ. BÁSICO)",2240,"COMPUTADORES",3,33.33333333]
[22400013,22400011,"COMPUTADOR (EQ. ADMINISTRATIVO)",2240,"COMPUTADORES",3,33.33333333]
[22400014,22400012,"PORTATIL (EQ. ADMINISTRATIVO)",2240,"COMPUTADORES",3,33.33333333]
[22400015,22400013,"TABLET (EQ. ADMINISTRATIVO)",2240,"COMPUTADORES",3,33.33333333]
[22400016,22400014,"MONITOR (EQ. ADMINISTRATIVO)",2240,"COMPUTADORES",3,33.33333333]
[22450001,22400015,"IMPRESSORA (EQ. ADMINISTRATIVO)",2240,"COMPUTADORES",3,33.33333333]
[22450002,22400016,"EQ. INFORMATICO OUTRO (EQ. ADMINISTRATIVO)",2240,"COMPUTADORES",3,33.33333333]
[22450003,22450001,"EQUIP. CENTROS DE FORMAÇÃO PROFISSIONAL (EQUIP. BÁSICO)",2245,"EQUIPAM. CENTROS  FORMAÇÃO PROFISSIONAL",6,16.66666667]
[22450004,22450002,"EQUIP. CENTROS DE FORMAÇÃO PROFISSIONAL (OUTRAS)",2245,"EQUIPAM. CENTROS  FORMAÇÃO PROFISSIONAL",6,16.66666667]
[22500001,22450003,"EQUIP. CENTROS DE FORMAÇÃO PROFISSIONAL (EQUIP. ADMIN.)",2245,"EQUIPAM. CENTROS  FORMAÇÃO PROFISSIONAL",6,16.66666667]
[22510001,22450004,"EQUIP. CENTROS FORM. PROFISSIONAL (2ª MÃO)",2245,"EQUIPAM. CENTROS  FORMAÇÃO PROFISSIONAL",3,33.33333333]
[22510002,22500001,"EQUIPAMENTO DE ENERGIA SOLAR",2250,"EQUIPAMENTOS DE ENERGIA SOLAR",4,25]
[22550001,22510001,"APARELHOS TELEMÓVEIS (EQ. BASICO)",2251,"APARELHOS TELEMOVEIS",5,20]
[22600001,22510002,"TELEFONES (EQ. BASICO)",2251,"APARELHOS TELEMOVEIS",5,20]
[22650001,22550001,"EQUIP. OFICINAS",2255,"EQUIP.OFICINAS PRIVADAS DE CARPINTARIA",8,12.5]
[22650002,22600001,"EQUIP. OFICINA MECANICA",2260,"EQUIP.OFIC. PRIV. SERRALHARIA E MECÂNICA",7,14.28571429]
[22700001,22650001,"FERRAMENTAS E UTENSÍLIOS",2265,"FERRAMENTAS E UTENSÍLIOS",4,25]
[22750001,22650002,"MATERIAL DIDACTICO",2265,"FERRAMENTAS E UTENSÍLIOS",4,25]
[22750002,22700001,"GUINDASTES",2270,"GUINDASTES",8,12.5]
[22750003,22750001,"Máquinas de escrever, calcular e fotocopiar",2275,"MAQ. ESCREVER, CALC., CONTAB., FOTOCOP.",5,20]
[22800001,22750002,"MÁQ. ESCREVER, CALC, CONTAB., FOTOCOPIAR",2275,"MAQ. ESCREVER, CALC., CONTAB., FOTOCOP.",5,20]
[22900001,22750003,"PROJECTORES (EQ. BASICO)",2275,"MAQ. ESCREVER, CALC., CONTAB., FOTOCOP.",5,20]
[22950001,22800001,"MÁQUINAS E FERRAMENTAS",2280,"MÁQUINAS-FERRAMENTAS LIGEIRAS",5,20]
[22950002,22900001,"MÁQUINAS DE LAVAGEM AUTOMÁTICA VEÍCULOS",2290,"MÁQUINAS LAVAGEM AUTOM. AUTOMÓVEIS",5,20]
[22950003,22950001,"MÁQUINAS NÃO ESPECIFICADAS (OUTROS)",2295,"MÁQUINAS NÃO ESPECIFICADAS",8,12.5]
[23000001,22950002,"MÁQUINAS NÃO ESPECIFICADAS (EQUIP. BÁSICO)",2295,"MÁQUINAS NÃO ESPECIFICADAS",8,12.5]
[23000002,22950003,"MÁQUINAS NÃO ESPECIFICADAS (EQUIP. ADMINIST.)",2295,"MÁQUINAS NÃO ESPECIFICADAS",8,12.5]
[23050001,23000001,"MATERIAL DE INCÊNDIO (EXTINTORES E OUTROS)",2300,"MATERIAL DE INCÊNDIO ( EXTINTORES, ETC )",4,25]
[23100001,23000002,"MATERIAL DE INCÊNDIO",2300,"MATERIAL DE INCÊNDIO ( EXTINTORES, ETC )",4,25]
[23150001,23050001,"MATERIAL DE QUEIMA",2305,"MATERIAL DE QUEIMA",7,14.28571429]
[23150002,23100001,"MOTORES (EQ. BASICO)",2310,"MOTORES",8,12.5]
[23150003,23150001,"TELEVISORES/VIDEOS (EQ. BÁSICO)",2315,"TELEVISORES",7,14.28571429]
[23200001,23150002,"CAMARA VIDEO (EQ. BASICO)",2315,"TELEVISORES",7,14.28571429]
[23250001,23150003,"VIDEOPROJECTOR (EQ. BASICO)",2315,"TELEVISORES",7,14.28571429]
[23300001,"GRUPO 4 - MATERIAL ROLANTE OU DE TRANSPORTE"]
[23350001,23200001,"AERONAVES",2320,"AERONAVES",5,20]
[23400001,23250001,"BARCOS",2325,"BARCOS DE FERRO",14,7.142857143]
[23450001,23300001,"BARCOS",2330,"BARCOS DE MADEIRA",10,10]
[23500001,23350001,"BARCOS",2335,"BARCOS DE BORRACHA",8,12.5]
[23550001,23400001,"BICICLETAS, TRICICLOS E MOTOCICLOS",2340,"BICICLETAS, TRICICLOS E MOTOCICLOS",4,25]
[23600001,23450001,"TRACTORES E ATRELADOS",2345,"TRACTOR.,EMPILHAD.,DUMPERS",6,16.66666667]
[23650001,23500001,"VAGÕES",2350,"VAGÕES",25,4]
[23750001,23550001,"VEICULOS DE TRACÇÃO ANIMAL",2355,"VEÍCULOS TRACÇÃO ANIMAL, ANIMAIS DE TIRO",8,12.5]
[23750002,23600001,"VIAS FÉRREAS",2360,"VIAS FÉRREAS NORMAIS",25,4]
[23800001,23650001,"VIAS FÉRREAS",2365,"VIAS( DECAUVILLE), MATERIAL ROLANTE",10,10]
[23850001,23750001,"VEÍCULOS",2375,"VEICULOS AUTOMOVEIS LIGEIROS E MISTOS",4,25]
[23900001,23750002,"BENS ADQUIRIDOS EM ESTADO DE USO",2375,"VEICULOS AUTOMOVEIS LIGEIROS E MISTOS",3,33.33333333]
[23950001,23800001,"VEÍCULOS",2380,"VEICULOS AUTOMOVEIS PESADOS PASSAGEIROS",7,14.28571429]
[24000001,23850001,"VEICULOS",2385,"VEICUL.AUTOM. PESADOS, REBOQ MERCADORIAS",5,20]
[24050001,23900001,"VEÍCULOS",2390,"VEICUL.AUTOM.PESADOS MERC.FORTE DESGASTE",4,25]
[24050002,23950001,"TANQUES",2395,"TANQUES",6,16.66666667]
[24100001,"GRUPO 5 - ELEMENTOS DIVERSOS"]
[24150001,24000001,"ARTIGOS DE DECORAÇÃO",2400,"CONFORTO E DECORAÇÃO - ALCATIFAS",4,25]
[24200001,24050001,"OUTROS",2405,"CONFORTO E DECORAÇÃO - OUTROS",8,12.5]
[24200002,24050002,"OUTROS",2405,"CONFORTO E DECORAÇÃO - OUTROS",8,12.5]
[24250001,24100001,"ENCERADOS",2410,"ENCERADOS",2,50]
[24300001,24150001,"EQUIPAMENTO PUBLICITÁRIO",2415,"EQUIPAMENTO PUBLICITÁRIO NA VIA PÚBLICA",8,12.5]
[24300002,24200001,"LIVROS, FILMES, DISCOS E CASSETES",2420,"FILMES, DISCOS E CASSETES",4,25]
[24300003,24200002,"LIVROS",2420,"FILMES, DISCOS E CASSETES",1,100]
[24300004,24250001,"MATERIAL DE DESENHO E TOPOGRAFIA",2425,"MATERIAL DE DESENHO E TOPOGRAFIA",8,12.5]
[24300005,24300001,"MOBILIÁRIO (EQUIP. ADMIN.)",2430,"MOBILIARIO",8,12.5]
[24300006,24300002,"MOBILIÁRIO (EQUIP. BÁSICO)",2430,"MOBILIARIO",8,12.5]
[24300007,24300003,"MOBILIÁRIO 2ª MÃO (EQUIP. BÁSICO)",2430,"MOBILIARIO",2,50]
[24300008,24300004,"MOBILIÁRIO 2ª MÃO (EQUIP. ADMIN.)",2430,"MOBILIARIO",2,50]
[24300009,24300005,"SECRETÁRIA/MESA (EQ. BÁSICO)",2430,"MOBILIARIO",8,12.5]
[24300010,24300006,"CADEIRA (EQ. BÁSICO)",2430,"MOBILIARIO",8,12.5]
[24300011,24300007,"ARMARIO (EQ. BÁSICO)",2430,"MOBILIARIO",8,12.5]
[24350001,24300008,"BLOCO GAVETAS (EQ. BÁSICO)",2430,"MOBILIARIO",8,12.5]
[24400001,24300009,"OUTRO MOBILIÁRIO (EQ. BÁSICO)",2430,"MOBILIARIO",8,12.5]
[24400002,24300010,"BANCADAS LABORATORIO (EQ. BÁSICO)",2430,"MOBILIARIO",8,12.5]
[24400003,24300011,"ESTANTES (EQ. BÁSICO)",2430,"MOBILIARIO",8,12.5]
[24400004,24350001,"MOLDES",2435,"MOLDES, MATRIZES, FORMAS E CUNHOS",4,25]
[24450001,24400001,"PROGRAMAS DE COMPUTADOR (EQUIP. BÁSICO)",2440,"PROGRAMAS DE COMPUTADORES",3,33.33333333]
[24500001,24400002,"PROGRAMAS DE COMPUTADOR (EQUIP. ADMIN.)",2440,"PROGRAMAS DE COMPUTADORES",3,33.33333333]
[24550001,24400003,"PROGRAMAS DE COMPUTADORES",2440,"PROGRAMAS DE COMPUTADORES",3,33.33333333]
[24600001,24400004,"PROGRAMAS DE COMPUTADOR (LICENÇAS)",2440,"PROGRAMAS DE COMPUTADORES",3,33.33333333]
[24700001,24450001,"TARAS E VASILHAMES",2445,"TARAS E VASILHAMES DE MADEIRA",5,20]
[24750001,24500001,"TARAS E VASILHAMES",2450,"TARAS E VASILHAMES DE METAL",7,14.28571429]
[24750002,24550001,"TARAS E VASILHAME",2455,"TARAS E VASILHAMES DE OUTROS MATERIAIS",3,33.33333333]
[24759999,24600001,"DESPESAS DE INSTALAÇÃO",2460,"DESPESAS DE INSTALAÇÃO",3,33.33333333]
[null,"DIVISÃO III - ACTIVOS INTANGIVEIS"]
[null,24700001,"DESPESAS DE INVEST. E DESENVOLVIMENTO",2470,"DESPESAS INVESTIGAÇÃO E DESENVOLVIMENTO",3,33.33333333]
[null,24750001,"ELEMENTOS DE PROPRIEDADE INDUSTRIAL",2475,"PATENTES,MARCAS,ALVARÁS,OUTROS DIREITOS",3,33.33333333]
[null,24750002,"LICENÇAS DE SOFTWARE",2475,"PATENTES,MARCAS,ALVARÁS,OUTROS DIREITOS",1,100]
[null,24759999,"LICENÇA",2475,"PATENTES,MARCAS,ALVARÁS,OUTROS DIREITOS",1,100]

{"sheet":"Cálculo Seg. acidentes trabalho","index":13,"n_rows":20,"n_cols":20,"rows_kept":20,"hidden":true,"merged":[[0,3,0,7],[0,9,0,13],[0,15,0,19],[1,3,1,7],[1,9,1,13],[1,15,1,19],[11,15,11,19]]}
["Cálculo da massa salarial do trabalhor",null,null,"Valor do seguro de acidentes de trabalho ",{"$nulls":5},"Valor do seguro de acidentes de trabalho ",{"$nulls":5},"Valor do seguro de acidentes de trabalho "]
[null,"Valor",null,"(Novembro)",{"$nulls":5},"(Junho)",{"$nulls":5},"(Janeiro a Maio, Julho a Outubro e Dezembro)"]
["Vencimento base mensal",{"$f":"'Post docs'!B5","v":{"v":2459.95,"d":"2,459.95 €"}},{"$nulls":5},"Valor ",{"$nulls":5},"Valor ",{"$nulls":5},"Valor "]
["Subsídio alimentação (média 22 dias/mês)",{"$f":"4.52*22","v":{"v":99.44,"d":"99.44 €"}},null,"Total da massa salarial",1,null,null,{"$f":"B8","v":{"v":3891.8629166666665,"d":"3,891.86 €"}},null,"Total da massa salarial",1,null,null,{"$f":"B9","v":{"v":5121.837916666666,"d":"5,121.84 €"}},null,"Total da massa salarial",1,null,null,{"$f":"B10","v":{"v":2661.8879166666666,"d":"2,661.89 €"}}]
["Subsídio férias (Junho)",{"$f":"B3","v":{"v":2459.95,"d":"2,459.95 €"}},null,"Taxa do contrato",2,{"v":0.004,"d":"0.400%"},{"$nulls":3},"Taxa do contrato",2,{"v":0.004,"d":"0.400%"},{"$nulls":3},"Taxa do contrato",2,{"v":0.004,"d":"0.400%"}]
["Subsídio natal (1/24 avos)",{"$f":"B3/24","v":{"v":102.49791666666665,"d":"102.50 €"}},null,"Prémio comercial",3,null,"3=1*2",{"$f":"H4*F5","v":{"v":15.567451666666667,"d":"15.57 €"}},null,"Prémio comercial",3,null,"3=1*2",{"$f":"N4*L5","v":{"v":20.487351666666665,"d":"20.49 €"}},null,"Prémio comercial",3,null,"3=1*2",{"$f":"T4*R5","v":{"v":10.647551666666667,"d":"10.65 €"}}]
["Subsídio natal (50% - Novembro)",{"$f":"B3/2","v":{"v":1229.975,"d":"1,229.98 €"}},null,"Imposto de selo",4,{"v":0.05,"d":"5.000%"},"4=3*4",{"$f":"H6*F7","v":{"v":0.7783725833333334,"d":"0.78 €"}},null,"Imposto de selo",4,{"v":0.05,"d":"5.000%"},"4=3*4",{"$f":"N6*L7","v":{"v":1.0243675833333332,"d":"1.02 €"}},null,"Imposto de selo",4,{"v":0.05,"d":"5.000%"},"4=3*4",{"$f":"T6*R7","v":{"v":0.5323775833333334,"d":"0.53 €"}}]
["Total (Novembro)",{"$f":"SUM(B3,B4,B6,B7)","v":{"v":3891.8629166666665,"d":"3,891.86 €"}},null,"INEM",5,{"v":0.025,"d":"2.500%"},"5=3*2,5%",{"$f":"H6*F8","v":{"v":0.3891862916666667,"d":"0.39 €"}},null,"INEM",5,{"v":0.025,"d":"2.500%"},"5=3*2,5%",{"$f":"N6*L8","v":{"v":0.5121837916666666,"d":"0.51 €"}},null,"INEM",5,{"v":0.025,"d":"2.500%"},"5=3*2,5%",{"$f":"T6*R8","v":{"v":0.2661887916666667,"d":"0.27 €"}}]
["Total (Junho)",{"$f":"SUM(B3:B6)","v":{"v":5121.837916666666,"d":"5,121.84 €"}},null,"FAT",6,{"v":1.5E-3,"d":"0.150%"},"6=1*0,15%",{"$f":"H4*F9","v":{"v":5.837794375,"d":"5.84 €"}},null,"FAT",6,{"v":1.5E-3,"d":"0.150%"},"6=1*0,15%",{"$f":"N4*L9","v":{"v":7.682756875,"d":"7.68 €"}},null,"FAT",6,{"v":1.5E-3,"d":"0.150%"},"6=1*0,15%",{"$f":"T4*R9","v":{"v":3.992831875,"d":"3.99 €"}}]
["Total (restantes meses)",{"$f":"B3+B4+B6","v":{"v":2661.8879166666666,"d":"2,661.89 €"}},null,"Prémio (1 mês)",7,null,"7=3+4+5+6",{"$f":"SUM(H6:H9)","v":{"v":22.57280491666667,"d":"22.57 €"}},null,"Prémio (1 mês)",7,null,"7=3+4+5+6",{"$f":"SUM(N6:N9)","v":{"v":29.706659916666663,"d":"29.71 €"}},null,"Prémio (11 meses)",7,null,"7=3+4+5+6",{"$f":"SUM(T6:T9)*11","v":{"v":169.82844908333334,"d":"169.83 €"}}]
[]
[]
[]
["Prémio total (12 meses)",{"$f":"T10+N10+H10","v":{"v":222.1079139166667,"d":"222.11 €"}}]
[]
[]
[]
[]
[]
["Nota: o cálculo deve ser atualizado em função do nível remuneratório aplicável."]

{"sheet":"Cálculo Seg. acidentes trab","index":14,"n_rows":31,"n_cols":20,"rows_kept":31,"hidden":true,"merged":[[1,3,1,7],[1,9,1,13],[1,15,1,19],[2,3,2,7],[2,9,2,13],[2,15,2,19],[18,3,18,7],[18,9,18,13],[18,15,18,19],[19,3,19,7],[19,9,19,13],[19,15,19,19]]}
["Contrato Investigador Carreira "]
["Cálculo da massa salarial do trabalhor",null,null,"Valor do seguro de acidentes de trabalho ",{"$nulls":5},"Valor do seguro de acidentes de trabalho ",{"$nulls":5},"Valor do seguro de acidentes de trabalho "]
[null,"Valor",null,"(Novembro)",{"$nulls":5},"(Junho)",{"$nulls":5},"(Janeiro a Maio, Julho a Outubro e Dezembro)"]
["Vencimento base mensal",{"$f":"#REF!","v":{"$error":"#REF!"}},{"$nulls":5},"Valor ",{"$nulls":5},"Valor ",{"$nulls":5},"Valor "]
["Subsídio alimentação (média 22 dias/mês)",{"$f":"4.52*22","v":{"v":99.44,"d":"99.44 €"}},null,"Total da massa salarial",1,null,null,{"$f":"B9","v":{"$error":"#REF!"}},null,"Total da massa salarial",1,null,null,{"$f":"B10","v":{"$error":"#REF!"}},null,"Total da massa salarial",1,null,null,{"$f":"B11","v":{"$error":"#REF!"}}]
["Subsídio férias (Junho)",{"$f":"B4","v":{"$error":"#REF!"}},null,"Taxa do contrato",2,{"v":0.004,"d":"0.400%"},{"$nulls":3},"Taxa do contrato",2,{"v":0.004,"d":"0.400%"},{"$nulls":3},"Taxa do contrato",2,{"v":0.004,"d":"0.400%"}]
["Subsídio natal (1/24 avos)",{"$f":"B4/24","v":{"$error":"#REF!"}},null,"Prémio comercial",3,null,"3=1*2",{"$f":"H5*F6","v":{"$error":"#REF!"}},null,"Prémio comercial",3,null,"3=1*2",{"$f":"N5*L6","v":{"$error":"#REF!"}},null,"Prémio comercial",3,null,"3=1*2",{"$f":"T5*R6","v":{"$error":"#REF!"}}]
["Subsídio natal (50% - Novembro)",{"$f":"B4/2","v":{"$error":"#REF!"}},null,"Imposto de selo",4,{"v":0.05,"d":"5.000%"},"4=3*4",{"$f":"H7*F8","v":{"$error":"#REF!"}},null,"Imposto de selo",4,{"v":0.05,"d":"5.000%"},"4=3*4",{"$f":"N7*L8","v":{"$error":"#REF!"}},null,"Imposto de selo",4,{"v":0.05,"d":"5.000%"},"4=3*4",{"$f":"T7*R8","v":{"$error":"#REF!"}}]
["Total (Novembro)",{"$f":"SUM(B4,B5,B7,B8)","v":{"$error":"#REF!"}},null,"INEM",5,{"v":0.025,"d":"2.500%"},"5=3*2,5%",{"$f":"H7*F9","v":{"$error":"#REF!"}},null,"INEM",5,{"v":0.025,"d":"2.500%"},"5=3*2,5%",{"$f":"N7*L9","v":{"$error":"#REF!"}},null,"INEM",5,{"v":0.025,"d":"2.500%"},"5=3*2,5%",{"$f":"T7*R9","v":{"$error":"#REF!"}}]
["Total (Junho)",{"$f":"SUM(B4:B7)","v":{"$error":"#REF!"}},null,"FAT",6,{"v":1.5E-3,"d":"0.150%"},"6=1*0,15%",{"$f":"H5*F10","v":{"$error":"#REF!"}},null,"FAT",6,{"v":1.5E-3,"d":"0.150%"},"6=1*0,15%",{"$f":"N5*L10","v":{"$error":"#REF!"}},null,"FAT",6,{"v":1.5E-3,"d":"0.150%"},"6=1*0,15%",{"$f":"T5*R10","v":{"$error":"#REF!"}}]
["Total (restantes meses)",{"$f":"B4+B5+B7","v":{"$error":"#REF!"}},null,"Prémio (1 mês)",7,null,"7=3+4+5+6",{"$f":"SUM(H7:H10)","v":{"$error":"#REF!"}},null,"Prémio (1 mês)",7,null,"7=3+4+5+6",{"$f":"SUM(N7:N10)","v":{"$error":"#REF!"}},null,"Prémio (11 meses)",7,null,"7=3+4+5+6",{"$f":"SUM(T7:T10)*11","v":{"$error":"#REF!"}}]
[]
["Prémio total (12 meses)",{"$f":"T11+N11+H11","v":{"$error":"#REF!"}}]
["Nota: o cálculo deve ser atualizado em função do nível remuneratório aplicável."]
[]
[]
[]
["Contrato Doutorado (DL 57_2016)"]
["Cálculo da massa salarial do trabalhor",null,null,"Valor do seguro de acidentes de trabalho ",{"$nulls":5},"Valor do seguro de acidentes de trabalho ",{"$nulls":5},"Valor do seguro de acidentes de trabalho "]
[null,"Valor",null,"(Novembro)",{"$nulls":5},"(Junho)",{"$nulls":5},"(Janeiro a Maio, Julho a Outubro e Dezembro)"]
["Vencimento base mensal",{"$f":"'Post docs'!B3","v":{"v":2459.95,"d":"2,459.95 €"}},{"$nulls":5},"Valor ",{"$nulls":5},"Valor ",{"$nulls":5},"Valor "]
["Subsídio alimentação (média 22 dias/mês)",{"$f":"4.52*22","v":{"v":99.44,"d":"99.44 €"}},null,"Total da massa salarial",1,null,null,{"$f":"B26","v":{"v":3891.8629166666665,"d":"3,891.86 €"}},null,"Total da massa salarial",1,null,null,{"$f":"B27","v":{"v":5121.837916666666,"d":"5,121.84 €"}},null,"Total da massa salarial",1,null,null,{"$f":"B28","v":{"v":2661.8879166666666,"d":"2,661.89 €"}}]
["Subsídio férias (Junho)",{"$f":"B21","v":{"v":2459.95,"d":"2,459.95 €"}},null,"Taxa do contrato",2,{"v":0.004,"d":"0.400%"},{"$nulls":3},"Taxa do contrato",2,{"v":0.004,"d":"0.400%"},{"$nulls":3},"Taxa do contrato",2,{"v":0.004,"d":"0.400%"}]
["Subsídio natal (1/24 avos)",{"$f":"B21/24","v":{"v":102.49791666666665,"d":"102.50 €"}},null,"Prémio comercial",3,null,"3=1*2",{"$f":"H22*F23","v":{"v":15.567451666666667,"d":"15.57 €"}},null,"Prémio comercial",3,null,"3=1*2",{"$f":"N22*L23","v":{"v":20.487351666666665,"d":"20.49 €"}},null,"Prémio comercial",3,null,"3=1*2",{"$f":"T22*R23","v":{"v":10.647551666666667,"d":"10.65 €"}}]
["Subsídio natal (50% - Novembro)",{"$f":"B21/2","v":{"v":1229.975,"d":"1,229.98 €"}},null,"Imposto de selo",4,{"v":0.05,"d":"5.000%"},"4=3*4",{"$f":"H24*F25","v":{"v":0.7783725833333334,"d":"0.78 €"}},null,"Imposto de selo",4,{"v":0.05,"d":"5.000%"},"4=3*4",{"$f":"N24*L25","v":{"v":1.0243675833333332,"d":"1.02 €"}},null,"Imposto de selo",4,{"v":0.05,"d":"5.000%"},"4=3*4",{"$f":"T24*R25","v":{"v":0.5323775833333334,"d":"0.53 €"}}]
["Total (Novembro)",{"$f":"SUM(B21,B22,B24,B25)","v":{"v":3891.8629166666665,"d":"3,891.86 €"}},null,"INEM",5,{"v":0.025,"d":"2.500%"},"5=3*2,5%",{"$f":"H24*F26","v":{"v":0.3891862916666667,"d":"0.39 €"}},null,"INEM",5,{"v":0.025,"d":"2.500%"},"5=3*2,5%",{"$f":"N24*L26","v":{"v":0.5121837916666666,"d":"0.51 €"}},null,"INEM",5,{"v":0.025,"d":"2.500%"},"5=3*2,5%",{"$f":"T24*R26","v":{"v":0.2661887916666667,"d":"0.27 €"}}]
["Total (Junho)",{"$f":"SUM(B21:B24)","v":{"v":5121.837916666666,"d":"5,121.84 €"}},null,"FAT",6,{"v":1.5E-3,"d":"0.150%"},"6=1*0,15%",{"$f":"H22*F27","v":{"v":5.837794375,"d":"5.84 €"}},null,"FAT",6,{"v":1.5E-3,"d":"0.150%"},"6=1*0,15%",{"$f":"N22*L27","v":{"v":7.682756875,"d":"7.68 €"}},null,"FAT",6,{"v":1.5E-3,"d":"0.150%"},"6=1*0,15%",{"$f":"T22*R27","v":{"v":3.992831875,"d":"3.99 €"}}]
["Total (restantes meses)",{"$f":"B21+B22+B24","v":{"v":2661.8879166666666,"d":"2,661.89 €"}},null,"Prémio (1 mês)",7,null,"7=3+4+5+6",{"$f":"SUM(H24:H27)","v":{"v":22.57280491666667,"d":"22.57 €"}},null,"Prémio (1 mês)",7,null,"7=3+4+5+6",{"$f":"SUM(N24:N27)","v":{"v":29.706659916666663,"d":"29.71 €"}},null,"Prémio (11 meses)",7,null,"7=3+4+5+6",{"$f":"SUM(T24:T27)*11","v":{"v":169.82844908333334,"d":"169.83 €"}}]
[]
["Prémio total (12 meses)",{"$f":"T28+N28+H28","v":{"v":222.1079139166667,"d":"222.11 €"}}]
["Nota: o cálculo deve ser atualizado em função do nível remuneratório aplicável."]